B2G/QA/Automation/UI/Scrum/Backlog

From MozillaWiki
< B2G‎ | QA‎ | Automation‎ | UI‎ | Scrum
Jump to: navigation, search

New tasks

Full Query
ID Assigned to Summary Priority Whiteboard Resolution Flags
910216 Tests get slower unless you restart the device between each one. P4 [c=automation p= s= u=] unittest No flags
962700 [meta] Tracking bug for [auto?] submitting, and potentially being able to list, crashes, while running Gaia UI Tests -- No flags
970434 Add UI-tests for forceAuthentication P3 [fxa4fxos2.0] No flags
980757 Alison Shiue [dsds] Location of SIM Security for DSDS -- No flags
987046 [Gaia-ui-tests] Discussion of Gaia-ui-tests/marionette restruct P3 No flags
1028192 Problems with ActiveSync accounts P1 [xfail] No flags
1039816 Investigate whether/how we can integrate Gaia UI Tests'/gaiatest's crash reporting into the HTML Reports we publish -- [affects=b2g][affects=gaia] No flags
1042843 How to verify whether video playback is going on from video playback gaiatest script? -- [mentor=zac][lang=py] No flags
1056001 Hide the logcat dump in the HTML report after marionette client has detected a crash -- No flags
1059703 [Dolphin] After gaia-ui-test the phone get stuck, physical keys are not available,adb can connect -- No flags
1060528 Add a simple end-to-end overdraw and HWC test -- No flags
1066309 Figure out how to name the phones so on logcat we see our name rather then serial -- No flags
1073436 Update launch atom to work for apps that use hash in the src -- No flags
1081470 [Flame][v2.0][Camera] Need to modify function - "camera.tap_switch_source()" after patch of Bug 1066885 lands on v2.0 -- No flags
1085652 set_time in gaia_test.py sets time incorrectly for some region -- No flags
1097492 Failed running gaia-ui-test on device -- No flags
1102838 unlock tests should wake the screen before sliding to unlock. -- No flags
1105168 Update insert_call_entry method to remove time.sleep() -- No flags
1107205 Get Gip on linux64 debug green and visible on Treeherder -- No flags
1107920 [v2.2] Investigate test_capture_multiple_shots failure -- No flags
1108576 Zac C (:zac) Experiment with methods to speed up the keyboard's send() method -- No flags
1110102 [v2.2] Add test to verify that the video recording stops immediately when going to homescreen -- No flags
1111068 Add a setTimeout checker for Gaia integration tests to help catch intermittent failures -- No flags
1112146 Intermittent test_browser_bookmark.py TestBrowserBookmark.test_browser_bookmark | ElementNotVisibleException: ElementNotVisibleException: Element is not currently visible and may not be manipulated and a bunch more afterwards -- No flags
1113928 Naoki Hirata :nhirata (please use needinfo instead of cc) Browser UI Tests -- No flags
1115774 create a check of the Bookmark before deleting bookmark test -- No flags
1115799 [Browser] Check the menu window to verify that the Add to Homescreen option no longer exists after adding a bookmark to the homescreen -- No flags
1116744 [v2.2] Investigate test_toggle_bluetooth_settings intermittent failure on Jenkins -- No flags
1117804 Investigate test_call_log_groups failure -- [xfail] No flags
1118537 html5_player::HTML5Player::is_playing() is incomplete per HTML5 Video spec -- No flags
1125759 Intermitent unit test TestKill_test_kill_multiple -- No flags
1126736 [Flame][v2.0] Investigate test_browser_tabs.py timeout issue -- No flags
1126775 Investigate test_browser_save_image failure -- Array
1128557 Investigate false positive in test_unlock_to_homescreen_with_passcode -- No flags
1129019 test_IMAP_email_notification.py is failing intermittently, email notification is not received before timeout -- No flags
1129952 Investigate failure in test_homescreen_delete_app_packaged.py, packaged app fails to install -- No flags
1132465 Parametrize marionette desired capabilities for Gaia UI tests. -- No flags
1133810 test_fmradio_frequency_dialer failing to scroll/flick -- No flags
1138337 [Flame][Settings]Device will restart, then still display black page when device runs non_smoke automatication test. -- No flags
1138505 Improve failure analysis tool to add time-based analysis -- No flags
1138513 Draft of Gaia UI Test harness behavior -- No flags
1138569 Possible issues catching Gaia UI test crashes -- No flags
1139215 test_launch_l10n.py:test_launch_by_localised_name consistently fails on-device -- No flags
1139422 Intermittent test_killall.py TestKillAll.test_kill_all_twice | ScriptTimeoutException: ScriptTimeoutException: timed out -- No flags
1140017 test_dialer_clear_miss_call_notification.py is timing out after receiving the missed call. -- No flags
1140190 [meta] Reset Gaia UI Test results back to green -- No flags
1140276 test_dialer_receive_call_with_contact_photo.py failure -- No flags
1140277 test_dialer_clear_miss_call_notification.py failed because caller number is withheld -- No flags
1140278 test_dialer_miss_call_from_known_contact_notification.py failed because caller number is withheld -- No flags
1142621 test_import_edit_export_contact.py failed with AssertionError: u'Name2129' != u'Name2129 New' -- No flags
1142622 test_sms_notification.py failed with IOError: Connection to Marionette server is lost. Check gecko.log (desktop firefox) or logcat (b2g) for errors. -- No flags
1144686 test_settings_change_time_format consistently failing, seems to revert the time set -- [3.0-Daily-Testing] No flags
1146280 Enable intermittent: test_music_share_ringtone.py TestMusicShareRingtone.test_music_share_ringtone | TimeoutException: TimeoutException: Timed out after 10.1 seconds -- No flags
1146997 [Meta] Disable GIP tests that overlap with the existing GIJ -- No flags
1147851 Disable test_clear_phone_number.py on Treeherder -- No flags
1147852 Disable test_ftu_skip_tour_desktopb2g.py -- No flags
1147854 Disable test_gallery_crop_photo.py on Treeherder -- No flags
1147855 Disable test_gallery_delete_image.py on Treeherder -- No flags
1147856 Florin Strugariu [:Bebe] Disable test_gallery_edit_photo.py on Treeherder -- No flags
1148267 Provide wrap function for system app features -- No flags
1151696 [v2.2] Investigate test_sms_with_attachments.py failure -- No flags
1152802 Intermittent test_play_ogv_video.py TestPlayOgvVideo.test_play_ogv_video | TimeoutException: TimeoutException: Timed out after 20.3 seconds with message: Video files found on device: [{u'name': u'VID_0001.ogv', u'size': 691218}] -- No flags
1155746 Update all usage of HTMLElement.size and HTMLElement.location to use marionette.rect in tests -- No flags
1156843 Create PoC for Gaia Acceptance suite based on MarionetteJS -- No flags
1160112 [Dolphine 7715EA] test_settings_media_storage.py - AssertionError: u'0 B' != '120 KB' -- No flags
1160997 [v2.2][Gaia::UI Tests]test_sync_facebook_contacts.py:"TimeoutException: TimeoutException: Timed out after 59.9 seconds" -- No flags
1161000 [v2.2][Gaia::UI Tests]test_unlink_facebook.py:"TimeoutException: TimeoutException: Timed out after 60.2 seconds" -- No flags
1161047 Intermittent test_cards_view_with_two_apps.py TestCardsView.test_that_app_can_be_launched_from_cards_view | TimeoutException: TimeoutException: Connection timed out -- No flags
1161300 Intermittent test_cards_view_kill_apps_with_two_apps.py TestCardsViewTwoApps.test_kill_app_from_cards_view | TimeoutException: TimeoutException: Connection timed out -- No flags
1161445 [v2.2][Gaia::UI Tests]Device enter white-screens, becomes unresponsive, and spams computer (if connected) with 6 device folders when device run non-smoketest. -- No flags
1162404 [v2.2][Gaia::UI Tests]The tap_menu() in Email app.py:"NoSuchElementException: NoSuchElementException: Unable to locate element: #cardContainer .card.center .fld-nav-toolbar" -- No flags
1162406 [v2.2][Gaia::UI Tests]The tap_settings() in Email app.py: "TimeoutException: TimeoutException: Timed out after 10.5 seconds" -- No flags
1163747 show_controls() and controls_visible() in html5_player.py returns false positive -- fbimage No flags
1165937 Create set of sanity tests to qualify device/envs for MarionetteJS acceptance tests -- No flags
1167518 [v2.2][Gaia::UI Tests]test_settings_wifi.py: "ElementNotVisibleException: ElementNotVisibleException: Element is not visible" -- No flags
1171231 test_setup_and_send_imap_email.py: assert self.device.is_online AssertionError -- No flags
1172618 test_sms_notification.py: " TimeoutException: Timed out after 300.1 seconds with message: Notification did not appear. " -- No flags
1173416 Failing to flash devices when building adhoc.bitbar runs: "FATAL: Device session is null" -- No flags
1174282 test_dialer tests involving phone calls: "NoSuchElementException: Unable to locate element: .handled-call.incoming" -- No flags
1174449 Intermittent test_homescreen_column_layout.py TestHomescreenLayout.test_homescreen_column_layout | ElementNotVisibleException: ElementNotVisibleException: Element is not currently visible and may not be manipulated -- No flags
1176279 test_lockscreen_unlock_to_camera_with_passcode.py: "NameError: global name 'GaiaTestCase' is not defined" -- No flags
1176806 [v2.2][Gaia::UI Tests]test_setup_and_send_imap_email.py:"TypeError: setup_IMAP_email() takes exactly 3 arguments (2 given)" -- No flags
1181769 Flame: marketplace update notification banner is shown even when webapps update is disabled in the pref -- No flags
1183726 Manel Rhaiem [:manel] [Bugzilla Lite] Testing Dashboard Navigation(Assigned,Flagged,Filed) in Bugzilla Lite -- No flags
1184154 Manel Rhaiem [:manel] [Bugzilla Lite] Testing Search in Bugzilla Lite -- No flags
1184415 Manel Rhaiem [:manel] [Bugzilla Lite] Testing fill new Bug in Bugzilla Lite -- No flags
1185274 Peter Bylenga [:PBylenga] Create a new test for taking a photo with front facing camera -- No flags
1186075 [v18d_v4] Gaiatests sometimes hangs when restarting b2g -- No flags
1186388 Make a PEP8 linter run on every commit -- No flags
1186835 Jenkins intermittently fails to save report due to a stack overflow on bitbar jobs -- No flags
1188080 test_rocketbar_offline_behavior.py: "NoSuchWindowException: None" -- [319MB-Flame-Support] No flags
1188360 [Meta] Sort out Jenkins to get at least a couple of green builds back -- No flags
1189279 Factorize the Jenkins jobs -- No flags
1189468 Manel Rhaiem [:manel] [RTL] Test script for Contacts -- No flags
1189747 Stop using |skip-if = device == "desktop"| if we have another way to filter out a test against a desktop build -- No flags
1190883 Bitbar: Failed to contact device, due to time out. -- No flags
1191248 Spark job executes the test but fails to post the results to treeherder -- No flags
1194001 Oliver Nelson [:oliverthor] Create a new test for Airplane Mode Functionality with WiFi, Data Connection, Bluetooth, and NFC -- No flags
1194167 [v2.5][Gaia::UI Tests]test_homescreen_status_bar_icons_visibility.py: "AssertionError: False is not true" -- No flags
1196316 [meta] Automate the dogfood suite -- No flags
1197148 importing gaiatest package is throwing AttributeError -- No flags
1200837 Manel Rhaiem [:manel] [BuddyUP] Testing Create Account in BuddyUp App -- No flags
1201880 Music Player test function is inconsistent -- No flags
1203527 Make PageRegion accept locators -- No flags
1203600 test_email_one_header_displayed.py: TimeoutException: TimeoutException: Timed out after 10.3 seconds -- No flags
1204314 Manel Rhaiem [:manel] [Dogfood] [Settings] SIM Manager options display and functionality -- No flags
1204911 test_wifi_multiple_connect.py:AssertionError -- No flags
1205312 test_dialer_miss_call_from_known_contact_notification.py : TimeoutException: TimeoutException: Timed out after 10.4 seconds -- No flags
1209573 test_music_artist_mp3.py : TimeoutException: TimeoutException: Timed out after 10.2 seconds -- No flags
1211325 gaiatest 0.34 change list -- No flags
1212602 test_settings_dsds_cell_data.py : TimeoutException: TimeoutException: Timed out after 10.6 seconds -- No flags
1212838 Create an end-to-end automated test suite to make sure that gaiatest doesn't regress -- No flags
1215351 Remove distinction between the Search app and Browser app -- No flags
1217404 Manel Rhaiem [:manel] Delete test_browser_bookmark and its leftovers as it's already covered by Gij -- No flags
1217826 Create a decorator to facilitate the use of switch_to_shadow_root() -- No flags
1218461 test_sms_with_attachments.py : NoSuchElementException: NoSuchElementException: Unable to locate element: .test-confirm-select -- No flags
1218906 test_marketplace_packaged_app.py : NoSuchElementException: NoSuchElementException: Unable to locate element: gaia-app-icon[data-identifier="https://marketplace.firefox.com/app/9b628257-c986-47aa-bdb9-a654ec355108/manifest.webapp"] -- No flags
1219290 Migrate the Jenkins download jobs to TaskCluster -- No flags
1219348 test_browser_first_run.py : TimeoutException: TimeoutException: Timed out after 30.1 seconds -- No flags
1222975 Delete the Python tests that are already running in Gij and not testing more than the integration between Gecko and Gaia -- [gip-to-gij] No flags
1223427 test_settings_bluetooth.py : JavascriptException: JavascriptException: TypeError: GaiaDataLayer.getBluetoothDefaultAdapter(...) is undefined -- No flags
1223511 test_dialer_miss_call_from_known_contact_notification.py  : NoSuchElementException: NoSuchElementException: Unable to locate element: .handled-call.incoming -- No flags
1225535 test_marketplace_addon.py : TimeoutException: TimeoutException: Timed out after 10.1 seconds - -- No flags
1226572 Intermittent: NoSuchElementException: Unable to locate element: .handled-call.incoming -- [fromTaskcluster] No flags
1226577 Intermittent NoSuchElementException: Unable to locate element: img -- [fromTreeherder] No flags
1226578 Intermittent: MarionetteException: [Exception... "Component returned failure code: 0x8000ffff (NS_ERROR_UNEXPECTED) [nsIMessageSender.sendAsyncMessage]" nsresult: "0x8000ffff (NS_ERROR_UNEXPECTED)" location: "JS frame :: chrome://marionette/conte -- [fromTreeherder] No flags
1228303 Fix jshint errors -- No flags
1229322 test_cost_control_data_alert_mobile.py intermittently fails: The data limit notification appears before we wait on it -- No flags
1234262 test_sms_with_attachments.py : TimeoutException: TimeoutException: Timed out after 306.3 seconds -- No flags
1236934 Intermittent: TimeoutException: Timed out after 306.6 seconds on test_sms.py -- No flags
1240869 test_sms_notification_removed_when_sms_deleted.py : TimeoutException: TimeoutException: Timed out after 300.1 seconds -- No flags
1242623 test_cost_control_data_alert_mobile.py : ScriptTimeoutException: ScriptTimeoutException: timed out -- No flags
1242637 test_add_to_an_existing_contact_from_messages.py : ScriptTimeoutException: ScriptTimeoutException: timed out -- No flags
1242654 test_sms_report.py : TimeoutException: TimeoutException: Timed out after 120.0 seconds -- No flags
1245535 test_call_log_all_calls.py : TimeoutException: TimeoutException: Timed out after 10.0 seconds -- No flags
1245541 test_cost_control_data_alert_mobile.py : TimeoutException: TimeoutException: Timed out after 180.1 seconds -- No flags
1245543 test_dialer_receive_call.py : NoSuchElementException: NoSuchElementException: Unable to locate element: .handled-call.incoming -- No flags
1245620 test_add_and_call_ice_contact.py : TimeoutException: TimeoutException: Timed out after 10.1 seconds -- No flags
1245622 test_add_to_new_contact_from_messages.py : TimeoutException: TimeoutException: Timed out after 306.5 seconds -- No flags
1245626 test_sms_report.py: TimeoutException: TimeoutException: Timed out after 306.7 seconds -- No flags
1247674 test_browser_first_run.py : TimeoutException: TimeoutException: Timed out after 10.2 seconds -- No flags
1250239 test_clock_set_alarm.py : TimeoutException: TimeoutException: Timed out after 10.1 seconds -- No flags
1250252 lockscreen/test_lockscreen_unlock_to_homescreen.py : TimeoutException: TimeoutException: Timed out after 10.1 seconds -- No flags
1250479 Set up 2 DSDS devices and a DSDS job in MTV -- No flags
1251371 Michael Bryant (uber) We need an Inventory of the devices in the QA Lab for tracking purposes -- No flags

145 Total; 145 Open (100%); 0 Resolved (0%); 0 Verified (0%);


Chores

No results.

0 Total; 0 Open (0%); 0 Resolved (0%); 0 Verified (0%);


Automation requested

No results.

0 Total; 0 Open (0%); 0 Resolved (0%); 0 Verified (0%);