B2G/QA/Automation/UI/Scrum/Sprint Template

From MozillaWiki
< B2G‎ | QA‎ | Automation‎ | UI‎ | Scrum
Jump to: navigation, search

Sprint ## YYYY-MM-DD -> YYYY-MN-DD

Focuses

Tasks

Bugzilla

ID Assigned to Summary Resolution Priority Qa whiteboard
910216 Tests get slower unless you restart the device between each one. P4 [fxosqa-auto-backlog-]
924873 Investigate removing external dependencies from gaia-ui-tests WORKSFORME P4 [fxosqa-auto-dropped-s1]
926881 Johan Lorenzo [:jlorenzo] Write test to enable USB storage FIXED P2 [fxosqa-auto-s6+][fxosqa-auto-points=2]
927139 Florin Strugariu [:Bebe] Expand automated coverage around keyboard usage when composing a MMS message FIXED -- [fxosqa-auto-s1]
931045 Malini Das [:mdas] - Away, not checking bugmail Write tests to ensure there will be no slow down related to gaia-ui-test setup code P3 [fxosqa-auto-backlog-]
933412 Malini Das [:mdas] - Away, not checking bugmail set up CI and gather results for gaiatest performance tests involving memory dumps P2 [fxosqa-auto-backlog-]
937050 Hidden/directional characters in the string cause `select` wrapper method to fail. WORKSFORME P4 [fxosqa-auto-backlog+]
943897 Code timeout into contacts_settings.tap_import_from_sim() INVALID P4 [fxosqa-auto-backlog+]
946644 Dave Hunt (:davehunt) [away until 31-Jul-17] Update the gaia-ui-tests for running on emulators WONTFIX -- [fxosqa-auto-backlog-]
947145 Florin Strugariu [:Bebe] Output our test/device status mapping into a table FIXED P2 [fxosqa-auto-from-s4] [fxosqa-auto-s5]
962700 [meta] Tracking bug for [auto?] submitting, and potentially being able to list, crashes, while running Gaia UI Tests -- [fxosqa-auto-backlog-]
968741 Viorela Ioia [:viorela] Update test_create_new_alarm to wait for the alarm to trigger FIXED P2 [fxosqa-auto-s4]
970434 Add UI-tests for forceAuthentication P3 [fxosqa-auto-backlog+]
970669 gaia-ui-test "filenames" need to go on a diet WONTFIX P4 [fxosqa-auto-backlog+]
980208 Doug Sherk (:drs) (inactive) [DSDS][Dialer] Call button should display default SIM FIXED -- [fxosqa-auto-backlog+]
980757 Alison Shiue [dsds] Location of SIM Security for DSDS -- [fxosqa-auto-backlog+]
982839 Martijn Wargers (dead) Write a test to protect against the regression seen in bug 981804 (navigate out of fullscreen video) FIXED P1 fxosqa-auto-s5, fxosqa-auto-points=8, fxosqa-auto-from-s2, fxosqa-auto-from-s3, fxosqa-auto-from-s4,fxosqa-auto-from-s1
983089 Etienne Segonzac (:etienne) [DSDS] Choose SIM to call unknown contact in Call Log FIXED -- [fxosqa-auto-backlog+]
986431 Geo Mealer [:geo] -- This account is inactive after 2015-07-07 Investigate why tests are failing with "Keyboard not interpreted as displayed. Debug is_displayed(): False" WORKSFORME P1 [fxosqa-auto-from-s2] [fxosqa-auto-from-s3] [fxosqa-auto-s4]
987046 [Gaia-ui-tests] Discussion of Gaia-ui-tests/marionette restruct P3 [fxosqa-auto-backlog-]
987746 Create a mach target for running gaia-ui tests WONTFIX P3 [fxosqa-auto-backlog-]
989562 Martijn Wargers (dead) Write a test to install & launch a packaged app FIXED P1 [fxosqa-auto-from-s1] [fxosqa-auto-s2]
991671 Provide a simple way to run the python integration tests (aka UI Tests) -- [fxosqa-auto-backlog-]
1000863 Martijn Wargers (dead) Investigate test_fmradio_find_stations.py failure FIXED P2 [fxosqa-auto-from-s1] [fxosqa-auto-from-s2] [fxosqa-auto-from-s3] [fxosqa-auto-from-s4] [fxosqa-auto-from-s5][fxosqa-auto-from-s6][fxosqa-auto-s7]
1005862 Zibi Braniecki [:gandalf][:zibi] [Call Screen][Conference call] Wrong participant leaving the conference notification message FIXED -- [fxosqa-auto-backlog+]
1009099 Ween GaiaTestCase off wait_for_* methods DUPLICATE -- [fxosqa-auto-dropped-s1]
1011451 Create a "launch_by_touch" method in Homescreen app object WONTFIX P3 [fxosqa-auto-backlog-]
1013455 [marketplace-tests-gaia] Un-xfail payments tests when bug 1097928 is fixed FIXED P2 [fxosqa-auto-backlog-]
1014170 Bob Silverberg [:bsilverberg] [marketplace-tests-gaia] Add a test to check that entering an incorrrect PIN throws an error message FIXED P2 [fxosqa-auto-backlog-]
1014171 Bob Silverberg [:bsilverberg] [marketplace-tests-gaia] Add a test to check the 'Forgot your PIN' flow FIXED P2 [fxosqa-auto-backlog-]
1017567 Viorela Ioia [:viorela] Use Actions for "open_utility_tray" method FIXED P2 [fxosqa-auto-s1]
1020536 Bob Silverberg [:bsilverberg] [marketplace-tests-gaia] Move marketplace-tests-gaia to v1.4 and address waits, if necessary WONTFIX P1 [fxosqa-auto-backlog-]
1022132 [UI Tests] Intermittent Failure on Travis: TEST-UNEXPECTED-FAIL | test_a11y_unlock_to_homescreen.py test_a11y_unlock_to_homescreen.TestLockScreenAccessibility.test_a11y_unlock_to_homescreen | TimeoutException WORKSFORME -- [fxosqa-auto-backlog-]
1024715 Bob Silverberg [:bsilverberg] Create test_firefox_accounts_login to validate user authentication from both Settings and FMD WONTFIX P3 [fxosqa-auto-s5]
1028192 Problems with ActiveSync accounts P1 [fxosqa-auto-backlog+]
1029581 Anthony Ricaud (:rik) [Dialer] Contact name is not shown in the call log after having two contacts with same number and the first one is removed FIXED -- [fxosqa-auto-backlog+]
1030118 Intermittent test_a11y_keyboard_word_suggestions.py test_a11y_keyboard_word_suggestions.TestA11yKeyboardWordSuggestions.test_a11y_keyboard_word_suggestions | TimeoutException: TimeoutException: Timed out after 10.1 seconds with message: Keyboard not ... WORKSFORME -- [fxosqa-auto-backlog-]
1030679 Alexandre LISSY :gerard-majax Make Gaia UI tests runs Mulet INVALID P1 [fxosqa-auto-backlog-]
1032707 Zac C (:zac) Intermittent test_clock_create_new_alarm.py test_clock_create_new_alarm.TestClockCreateNewAlarm.test_clock_create_new_alarm | TimeoutException: TimeoutException: Timed out after 10.0 seconds with message: Keyboard not interpreted as displayed. Debug is_di WORKSFORME -- [fxosqa-auto-backlog+]
1032725 Anthony Ricaud (:rik) Facebook contact infos are not reflected in call screen FIXED -- [QAnalyst-Triage+][lead-review+][fxosqa-auto-backlog+]
1034630 Investigate failures caused by Homescreen not finish loading before timeout -- [fxosqa-auto-backlog+]
1037827 Intermittent test_play_ogg_video.py TestPlayOGGVideo.test_play_ogg_video | AssertionError: time.struct_time(tm_year=1900, tm_mon=1, tm_mday=1, tm_hour=0, tm_min=0, tm_sec=0, tm_wday=0, tm_yday=1, tm_isdst=-1) not greater than time.struct_time(tm_year=1900 WORKSFORME -- [fxosqa-auto-s1]
1039626 Add crash reporting to gaiatest WONTFIX -- [fxosqa-auto-backlog-]
1042843 How to verify whether video playback is going on from video playback gaiatest script? -- [fxosqa-auto-backlog-]
1047168 Martijn Wargers (dead) Modify test_play_youtube to play a video file locally FIXED -- fxosqa-auto-s4, fxosqa-auto-points=8, fxosqa-auto-from-s3, fxosqa-auto-from-s2, fxosqa-auto-from-s1
1052267 [FxA] Create automated testcases to test username & password string validation for firefox accounts WONTFIX P3 [fxosqa-auto-from-s5] [fxosqa-auto-from-s6] [fxosqa-auto-s7]
1053873 Intermittent test_launch_l10n.py TestLaunchL10n.test_launch_by_english_name_in_alternate_locale | ScriptTimeoutException: ScriptTimeoutException: timed out WORKSFORME -- [fxosqa-auto-backlog-]
1054307 Propose: Remove uses of connect_to_network in tests DUPLICATE -- [fxosqa-auto-backlog+]
1056001 Hide the logcat dump in the HTML report after marionette client has detected a crash -- [fxosqa-auto-backlog-]
1056008 Zac C (:zac) Remove tbpl-manifest.ini FIXED -- [fxosqa-auto-backlog-]
1056186 [FxA] Create unit tests for Firefox Accounts mock server process WONTFIX P3 [fxosqa-auto-backlog-]
1058724 [Meta] Explore monkey testing framework WONTFIX -- [fxosqa-auto-backlog-]
1059703 [Dolphin] After gaia-ui-test the phone get stuck, physical keys are not available,adb can connect -- [fxosqa-auto-backlog-]
1060528 Add a simple end-to-end overdraw and HWC test -- [fxosqa-auto-backlog-]
1061168 Intermittent test_a11y_phone_edit_contact.py TestAccessibilityPhoneEditContact.test_a11y_phone_edit_contact | TimeoutException: TimeoutException: Timed out after 10.1 seconds WORKSFORME -- [fxosqa-auto-backlog-]
1064299 Martijn Wargers (dead) Investigate intermittent keyboard failure when typing text in search bar WORKSFORME -- fxosqa-auto-s5
1065393 Intermittent test_a11y_utility_tray_visibility.py TestUtilityTrayVisibilityAccessibility.test_a11y_utility_tray_visibility | TimeoutException: TimeoutException: Connection timed out WORKSFORME -- [fxosqa-auto-backlog-]
1065410 Switch to the HTML log generated by mozlog FIXED -- [fxosqa-auto-backlog-]
1065413 Dave Hunt (:davehunt) [away until 31-Jul-17] Switch to the XUnit log generated by mozlog FIXED -- [fxosqa-auto-backlog-]
1065933 Dave Hunt (:davehunt) [away until 31-Jul-17] Marionette should throw a MarionetteException when a tap causes the frame to close unexpectedly FIXED P1 [fxosqa-auto-s1]
1066309 Figure out how to name the phones so on logcat we see our name rather then serial -- [fxosqa-auto-backlog-]
1068094 Experiment with moz-app-loaded in launch atom -- [fxosqa-auto-backlog-]
1069998 Better error messages for gaia UI tests when no SIM around? WONTFIX -- [fxosqa-auto-backlog-]
1071587 Martijn Wargers (dead) [v2.2] Investigate test_play_youtube_video failures FIXED -- [fxosqa-auto-s4]
1071592 Viorela Ioia [:viorela] Fix intermittent failure in test_keyboard.py FIXED -- [fxosqa-auto-s5]
1071647 Viorela Ioia [:viorela] [v2.1] Fix intermittent failure in test_cost_control_reset_wifi.py FIXED -- [fxosqa-auto-s1]
1072225 [v2.1] Tests are failing with JavascriptException: AbortError when launching an app -- [fxosqa-auto-from-s5][fxosqa-auto-s6][fxosqa-auto-dropped-s6]
1072973 Robert Chira [:RobertC] [v2.2] Capture crash report for intermittent crash in cost control tests WORKSFORME -- [fxosqa-auto-s1]
1073048 Running gaia-ui-test with "--type smoketest-bluetooth" runs only 1 test on my device FIXED -- [fxosqa-auto-backlog-]
1073436 Update launch atom to work for apps that use hash in the src -- [fxosqa-auto-backlog+]
1073651 Zac C (:zac) Intermittent test_a11y_keyboard_key_names.py TestA11yKeyboardKeyNames.test_a11y_keyboard_key_names | JavascriptException: JavascriptException: TypeError: Argument 1 of Window.getComputedStyle is not an object. FIXED -- [fxosqa-auto-backlog-]
1074117 Dave Hunt (:davehunt) [away until 31-Jul-17] Use expected conditions where appropriate and optimise element lookups FIXED -- [fxosqa-auto-backlog+]
1074314 Update test_endurance_browser_cell.py to use the new Browser app WONTFIX -- [fxosqa-auto-backlog-]
1074601 Tzu-Lin Huang [:dwi2][:tzhuang] The SIM 2 Voice mail displayed as a "Unknown contact" in dialer view and call log view FIXED -- [fxosqa-auto-backlog+][MGSEI-Triage+]
1074845 Zac C (:zac) Intermittent test_add_contact_to_favorites.py TestAddContactToFavorite.test_add_contact_to_favorite | AssertionError: u'Add FIXED -- [fxosqa-auto-backlog+]
1075504 Viorela Ioia [:viorela] Update test_gallery_view to correlate with the manual test FIXED -- [fxosqa-auto-s1]
1075510 Add test to verify the Notification for E-mail is displayed FIXED -- [fxosqa-auto-s1]
1075513 Viorela Ioia [:viorela] Update test_sms_contact to send the SMS message FIXED -- [fxosqa-auto-s1]
1075547 Robert Chira [:RobertC] Update test_call_log_all_calls to verify missed calls menu FIXED -- [fxosqa-auto-s1]
1075551 Add test to receive call/answer call from the lockscreen WONTFIX -- [fxosqa-auto-s1]
1077333 Viorela Ioia [:viorela] Investigate failure in test_add_to_new_contact_from_messages.py FIXED -- [fxosqa-auto-s1]
1077367 [v2.0] Investigate test_camera_capture_video failure DUPLICATE -- [fxosqa-auto-backlog-] [fxosqa-auto-dropped-s1]
1078156 Intermittent test_a11y_keyboard_word_suggestions.py TestA11yKeyboardWordSuggestions.test_a11y_keyboard_word_suggestions | JavascriptException: JavascriptException: TypeError: Argument 1 of Window.getComputedStyle is not an object. WONTFIX -- [fxosqa-auto-backlog-]
1078164 [v2.0] Investigate test_camera_capture_photo failure DUPLICATE -- [fxosqa-auto-backlog-]
1078247 Robert Chira [:RobertC] [v2.2] Fix keyboard object app after updates from Bug 996332 FIXED -- [fxosqa-auto-s1]
1078279 Intermittent test_a11y_phone_keypad.py TestAccessibilityPhoneKeypad.test_phone_keypad | JavascriptException: JavascriptException: TypeError: Argument 1 of Window.getComputedStyle is not an object. WORKSFORME -- [fxosqa-auto-backlog-]
1079163 Florin Strugariu [:Bebe] Intermittent test_add_photo_to_contact.py TestContacts.test_add_photo_from_gallery_to_contact | AssertionError: The picture associated with the contact was not changed. WORKSFORME -- [fxosqa-auto-s5]
1079233 Viorela Ioia [:viorela] Intermittent test_export_contacts_to_sdcard.py TestExportContactsToSDCard.test_export_contacts_to_sdcard | ElementNotVisibleException: ElementNotVisibleException: Element is not currently visible and may not be manipulated -- [fxosqa-auto-s5]
1080169 Florin Strugariu [:Bebe] Add a test that sends an sms with picture from Gallery attached FIXED -- [fxosqa-auto-from-s1] [fxosqa-auto-from-s2] [fxosqa-auto-s3]
1080557 Update test_browser_bookmark.py to delete the bookmark added FIXED -- [fxosqa-auto-s1]
1081470 [Flame][v2.0][Camera] Need to modify function - "camera.tap_switch_source()" after patch of Bug 1066885 lands on v2.0 -- [fxosqa-auto-backlog-]
1081473 [Flame][v2.0][Camera] Need to modify function - "tap_capture()" after patch of Bug 1066885 lands on v2.0 FIXED -- [fxosqa-auto-backlog-]
1082644 Florin Strugariu [:Bebe] Add to gaia UI tests files moztrap links of the implemented manual testcase FIXED -- [fxosqa-auto-from-s1] [fxosqa-auto-s2]
1082759 Johan Lorenzo [:jlorenzo] go_to_url(self, url) doesn't escape ~ to browse http://people.mozilla.com/~login/ FIXED -- [fxosqa-auto-backlog-]
1083126 Robert Chira [:RobertC] Update test_sms_with_attachments.py to match the manual smoketest FIXED -- [fxosqa-auto-from-s1] [fxosqa-auto-from-s2] [fxosqa-auto-s3]
1083217 Viorela Ioia [:viorela] Add a test to play a song in artist list view FIXED -- [fxosqa-auto-s2]
1083731 Johan Lorenzo [:jlorenzo] Add UI test for bug 1074379 WONTFIX -- [fxosqa-auto-backlog+]
1085652 set_time in gaia_test.py sets time incorrectly for some region -- [fxosqa-auto-backlog-]
1086269 Johan Lorenzo [:jlorenzo] Add a test to set up a conference call FIXED P2 [fxosqa-auto-s2]
1086277 Robert Chira [:RobertC] Add a test for add & delete a divider on homescreen FIXED -- [fxosqa-auto-s2]
1086563 Florin Strugariu [:Bebe] Write test to verify offline behaviour of the RocketBar FIXED -- [fxosqa-auto-from-s2] [fxosqa-auto-s3]
1086571 Robert Chira [:RobertC] Investigate and fix test_call_log_all_calls intermittent failures FIXED -- [fxosqa-auto-s2]
1086603 Johan Lorenzo [:jlorenzo] Add test test_browser_navigation.py to share a link to the SMS app FIXED P2 [fxosqa-auto-s2]
1086662 Martijn Wargers (dead) Add a test that ensures test_camera_capture_video.py saves a video file of a minimum size FIXED -- fxosqa-auto-s4, fxosqa-auto-points=8, fxosqa-auto-from-s3, fxosqa-auto-from-s2
1086676 Johan Lorenzo [:jlorenzo] Add a test to check notification when you miss a call from a known contact. FIXED -- [fxosqa-auto-s2]
1086680 Martijn Wargers (dead) Write an automated test for "Verify the user can import Facebook contacts from contacts app settings" moztrap smoketest FIXED -- fxosqa-auto-from-s2, fxosqa-auto-dropped-s3, fxosqa-auto-points=8, [fxosqa-auto-s7]
1086687 Martijn Wargers (dead) Write an automated test for "Unlink a previously linked Facebook contact from contact details" moztrap smoketest FIXED -- fxosqa-auto-from-s2, fxosqa-auto-dropped-s3, fxosqa-auto-points=8, [fxosqa-auto-s7][fxosqa-auto-points=2]
1087274 Florin Strugariu [:Bebe] Update test names because everythingme was replaced form FF OS and now it's called Rocketbar FIXED -- [fxosqa-auto-s5]
1087383 Viorela Ioia [:viorela] Add a test that sets the wallpaper from Gallery, by long press on the screen FIXED -- [fxosqa-auto-from-s2] [fxosqa-auto-s3]
1087926 Johan Lorenzo [:jlorenzo] Add a test to check that a Contact's photo appears when receiving a call. FIXED -- [fxosqa-auto-from-s2] [fxosqa-auto-from-s3] [fxosqa-auto-s4]
1090087 Robert Chira [:RobertC] Add test for saving an image from a webpage FIXED -- [fxosqa-auto-from-s2] [fxosqa-auto-s3]
1090092 Robert Chira [:RobertC] Add test for activating 4 column layout on homescreen FIXED -- [fxosqa-auto-s2]
1090281 Viorela Ioia [:viorela] Investigate failure in test_setup_and_send_imap_email.py FIXED -- [fxosqa-auto-from-s2] [fxosqa-auto-s4][fxosqa-auto-from-s3]
1090930 Intermittent test_a11y_keyboard_word_suggestions.py TestA11yKeyboardWordSuggestions.test_a11y_keyboard_word_suggestions | ScriptTimeoutException: ScriptTimeoutException: timed out WONTFIX -- [fxosqa-auto-backlog-]
1091158 Zac C (:zac) Intermittent test_persona_app.py TestPersonaStandard.test_persona_standard_sign_in | Exception: Could not get Persona user from personatestuser.org: {u'message': u'Cannot get email'} FIXED -- [fxosqa-auto-s5]
1091631 Update CallScreen.reject_call method to wait for the call screen to be not displayed FIXED -- [fxosqa-auto-s2]
1091676 Robert Chira [:RobertC] Investigate intermittent failure in test_cost_control_reset_wifi.py WONTFIX -- [fxosqa-auto-from-s2] [fxosqa-auto-from-s3] [fxosqa-auto-s4]
1091679 Florin Strugariu [:Bebe] Update tests to wait for the plivo call to end FIXED -- [fxosqa-auto-from-s2] [fxosqa-auto-s3]
1092132 Zac C (:zac) Update mozharness config for Gip to include chunking and gecko-log FIXED -- [fxosqa-auto-backlog-]
1092134 Intermittent test_a11y_volume_buttons_panel_visibility.py TestVolumeButtonsAccessibility.test_a11y_volume_buttons | AssertionError: None is not true -- [fxosqa-auto-backlog-]
1092195 Viorela Ioia [:viorela] Investigate failure in test_cost_control_ftu.py FIXED -- [fxosqa-auto-from-s2] [fxosqa-auto-s4][fxosqa-auto-from-s3]
1093036 Robert Chira [:RobertC] [v2.2] Update locators in email setup tests FIXED -- [fxosqa-auto-s3]
1093131 Florin Strugariu [:Bebe] Add a test that delete browser's history FIXED -- [fxosqa-auto-from-s2] [fxosqa-auto-from-s3] [fxosqa-auto-s4]
1093503 Robert Chira [:RobertC] [v2.2] Update locator in conference call test FIXED -- [fxosqa-auto-s3]
1093505 Robert Chira [:RobertC] [v2.2] Xfail test_dialer_airplane_mode.py because of Bug 1084252 FIXED -- [fxosqa-auto-s3]
1093583 Johan Lorenzo [:jlorenzo] [DSDS] Add test to make a phone call with default SIM FIXED -- [fxosqa-auto-from-s3][fxosqa-auto-from-s4][fxosqa-auto-s5][fxosqa-auto-points=3]
1093585 Johan Lorenzo [:jlorenzo] [DSDS] Add test to make a phone call with "Always ask" setting WONTFIX -- [fxosqa-auto-from-s3][fxosqa-auto-from-s4][fxosqa-auto-dropped-s5][fxosqa-auto-points=3]
1093589 Johan Lorenzo [:jlorenzo] [DSDS] Add test to receive phone call on both SIMs FIXED -- [fxosqa-auto-from-s3][fxosqa-auto-from-s4][fxosqa-auto-s5][fxosqa-auto-points=2]
1093608 Johan Lorenzo [:jlorenzo] [DSDS] Add test to check which SIM was involved in the call on the call log WONTFIX -- [fxosqa-auto-from-s3][fxosqa-auto-from-s4][fxosqa-auto-from-s5][fxosqa-auto-dropped-s6][fxosqa-auto-points=3]
1093874 No-Jun Park [:njpark] Create a new test case for loading a mix of valid/invalid image files into Gallery App FIXED -- [fxosqa-auto-s4]
1094073 Robert Chira [:RobertC] [v2.2] Update locator for device info test FIXED -- [fxosqa-auto-s3]
1094139 Johan Lorenzo [:jlorenzo] [DSDS] Add test to check that voicemail hotkey always ask for which SIM to use WONTFIX -- [fxosqa-auto-from-s4][fxosqa-auto-dropped-s5][fxosqa-auto-points=2]
1094144 Martijn Wargers (dead) Add a test that ensures test_play_*_video has the correct audio channel opened FIXED -- fxosqa-auto-s5, fxosqa-auto-from-s4, fxosqa-auto-points=8
1094151 Martijn Wargers (dead) Write a test to install & launch a packaged app from the Marketplace FIXED -- fxosqa-auto-points=8, fxosqa-auto-from-s4, fxosqa-auto-backlog+, [fxosqa-auto-s7]
1094185 Johan Lorenzo [:jlorenzo] [DSDS] Make testvars.json handle 2 SIMs FIXED -- [fxosqa-auto-s3][fxosqa-auto-points=3]
1094647 Florin Strugariu [:Bebe] Intermittent test_a11y_calendar_settings_view.py TestCalendarSettingsViewAccessibility.test_a11y_calendar_settings_view | StaleElementException: StaleElementException: The element reference is stale. Either the element is no longer attached to the DOM or FIXED -- fxosqa-auto-s3+
1095471 Zac C (:zac) Intermittent test_keyboard.py TestKeyboard.test_keyboard_basic | AssertionError: u'aG1 2Ds3~!=@.# ^a\u015bZ\xeed\xc6' != u'AG1 2Ds3~!=@.# ^a\u015bZ\xeed\xc6' WONTFIX -- [fxosqa-auto-backlog+]
1096325 Geo Mealer [:geo] -- This account is inactive after 2015-07-07 Intermittent test_launch_via_manifest.py TestLaunchViaManifest.test_launch_manifest | TimeoutException: TimeoutException: Connection timed out WONTFIX -- [fxosqa-auto-from-s5] [fxosqa-auto-from-s6] [fxosqa-auto-s7]
1096385 Investigate failure in test_call_log_all_calls.py, call log is displayed erroneously FIXED -- [fxosqa-auto-from-s5] [fxosqa-auto-dropped-s6] [fxosqa-auto-backlog+]
1096915 Robert Chira [:RobertC] Add a test to re-dial the last MO number by pressing the call button twice FIXED -- [fxosqa-auto-from-s4] [fxosqa-auto-s5]
1096920 Robert Chira [:RobertC] Add test to delete entire call log when it has several calls, All tab FIXED -- [fxosqa-auto-s4]
1096928 Florin Strugariu [:Bebe] Intermittent test_add_contact_to_favorites.py TestAddContactToFavorite.test_add_contact_to_favorite | TimeoutException: TimeoutException: Timed out after 10.1 seconds FIXED -- [fxosqa-auto-s4+]
1096933 Intermittent test_play_ogg_video.py TestPlayOGGVideo.test_play_ogg_video | AssertionError: time.struct_time(tm_year=1900, tm_mon=1, tm_mday=1, tm_hour=0, tm_min=0, tm_sec=0, tm_wday=0, tm_yday=1, tm_isdst=-1) not greater than time.struct_time(tm_year=1900 WONTFIX -- [fxosqa-auto-backlog+]
1096935 Intermittent test_privileged_app_geolocation_prompt.py TestPrivilegedAppGeolocationPrompt.test_geolocation_prompt | TimeoutException: TimeoutException: Connection timed out WORKSFORME -- [fxosqa-auto-backlog+]
1097035 Viorela Ioia [:viorela] Write a test to verify that the user can forward a sent message FIXED -- [fxosqa-auto-s4]
1097040 Viorela Ioia [:viorela] Write a test to verify that the SMS auto-save draft when message app terminated FIXED -- [fxosqa-auto-s5][fxosqa-auto-from-s4]
1097085 Florin Strugariu [:Bebe] Write test Verify that the Ringer Tone can be changed FIXED -- [fxosqa-auto-s4]
1097088 Florin Strugariu [:Bebe] Write test Battery Turn on Automatically options FIXED -- [fxosqa-auto-s4]
1097492 Failed running gaia-ui-test on device -- [fxosqa-auto-backlog-]
1097605 Martijn Wargers (dead) Update method for getting mobile data state in Usage app FIXED -- [fxosqa-auto-dropped-s4][fxosqa-auto-s7][fxosqa-auto-points=4]
1097754 Johan Lorenzo [:jlorenzo] test_dialer_receive_call_with_locked_screen.py sometimes doesn't wait until the callscreen arrives at the bottom of the screen WONTFIX -- [fxosqa-auto-from-s4][fxosqa-auto-from-s5][fxosqa-from-s6][fxosqa-auto-from-s7][fxosqa-auto-s8][fxosqa-auto-points=4]
1098107 Johan Lorenzo [:jlorenzo] Change the wait in AddNewNumber to avoid intermittent timeout with test_dialer_add_contact on b2gdesktop FIXED -- [fxosqa-auto-s5+][fxosqa-auto-points=4]
1098279 Johan Lorenzo [:jlorenzo] Add -dsds to existing Jenkins jobs FIXED -- [fxosqa-auto-s4][fxosqa-auto-points=1]
1098300 Viorela Ioia [:viorela] [v2.2] Investigate test_dialer_miss_call_from_known_contact_notification.py intermittent failure FIXED -- [fxosqa-auto-s4+]
1098311 Johan Lorenzo [:jlorenzo] Switch a device from the UI tests pool to DSDS FIXED -- [fxosqa-auto-s4][fxosqa-auto-points=1]
1098313 Johan Lorenzo [:jlorenzo] Create a job for DSDS test cases FIXED -- [fxosqa-auto-s4][fxosqa-auto-points=1]
1098317 Geo Mealer [:geo] -- This account is inactive after 2015-07-07 Put an extra SIM card in b2g-22.1 and update credentials FIXED -- [fxosqa-auto-s4][fxosqa-auto-points=1]
1098409 Florin Strugariu [:Bebe] Rename System app object to Service in line with bug 1080905 WONTFIX -- [fxosqa-auto-s8]
1098442 Johan Lorenzo [:jlorenzo] [v2.2] Investigate dialer test intermittent failures WONTFIX -- [fxosqa-auto-dropped-s8][fxosqa-auto-points=2]
1099041 Johan Lorenzo [:jlorenzo] Add the manifest file that sets the default values as a dependency to the others FIXED -- [fxosqa-auto-s4+][fxosqa-auto-points=1]
1099045 Intermittent test_warm_launch.py TestWarmLaunch.test_warm_launch | TimeoutException: TimeoutException: Connection timed out -- [fxosqa-auto-backlog+]
1100319 Robert Chira [:RobertC] [v2.2] Disable test_fmradio_find_stations.py due to Bug 1000863 FIXED -- [fxosqa-auto-backlog+]
1100390 No-Jun Park [:njpark] Create a new test case for the deletion of video from Preview FIXED -- [fxosqa-auto-backlog+]
1100411 lusob Create test to verify status bar icons appear when home screen is scrolled FIXED -- [fxosqa-auto-from-s4] [fxosqa-auto-from-s5] [fxosqa-auto-from-s6] [fxosqa-auto-dropped-s7]
1100733 Edward Chen[:edchen] [Feature][submodule] xxxxxxxxxxxxxx -- fxosqa-auto-tpe-backlog
1100846 Robert Chira [:RobertC] [v2.2] Investigate test_sms_with_attachments intermittent failure FIXED -- [fxosqa-auto-s4+]
1100975 Florin Strugariu [:Bebe] [v2.2] Investigate test_IMAP_email_notification intermittent failure WORKSFORME -- [fxosqa-auto-s5]
1100985 Investigate failure in test_browser_navigation.py WORKSFORME -- [fxosqa-auto-backlog+]
1100994 Robert Chira [:RobertC] [v2.2] Fix test_settings_device_info.py failure FIXED -- [fxosqa-auto-s4+]
1101227 Florin Strugariu [:Bebe] Intermittent test_system_notification_bar.py TestNotificationBar.test_notification_bar | AssertionError: 'TestNotificationBar_BODY' != u' FIXED -- [fxosqa-auto-s4+]
1101412 Florin Strugariu [:Bebe] Intermittent JavascriptException: JavascriptException: TypeError: window.wrappedJSObject.app.inputContext is null WORKSFORME -- [fxosqa-auto-from-s5][fxosqa-auto-s6]
1101421 Yura Zenevich [:yzen] Intermittent test_a11y_ftu_desktopb2g.py TestFtuAccessibility.test_a11y_ftu | TimeoutException: TimeoutException: Timed out after 10.1 seconds FIXED -- [fxosqa-auto-backlog-]
1102167 Florin Strugariu [:Bebe] Split the non-smoke test runs running on Jenkins device builds in two jobs FIXED -- [fxosqa-auto-s5]
1102330 Viorela Ioia [:viorela] [v2.2] Investigate test_set_up_conference_call intermittent failures WORKSFORME -- [fxosqa-auto-s6]
1102838 unlock tests should wake the screen before sliding to unlock. -- [fxosqa-auto-dropped-s6]
1102931 Viorela Ioia [:viorela] Intermittent test_ftu_with_tour.py TestFtu.test_ftu_with_tour | TimeoutException: TimeoutException: Timed out after 10.1 seconds -- [fxosqa-auto-from-s5][fxosqa-auto-s7]
1104001 Viorela Ioia [:viorela] Fix intermittent failure in test_sms_with_picture_attached.py FIXED -- [fxosqa-auto-s5]
1104049 Intermittent test_browser_play_video.py TestVideo.test_play_video | AssertionError: False is not true FIXED -- [fxosqa-auto-backlog+]
1104624 Robert Wood [:rwood] Tests are failing when trying to switch frame with MarionetteException: Frame not responding, switching to root frame FIXED -- [fxosqa-auto-backlog-]
1104645 Johan Lorenzo [:jlorenzo] Update the conditions regarding the number of digits displayed on the callscreen. FIXED -- [fxosqa-auto-s6][fxosqa-auto-points=1]
1104760 Intermittent test_browser_clear_browsing_history.py TestBrowserClearHistory.test_browser_clear_history | MarionetteException: MarionetteException: Component returned failure code: 0x80070057 (NS_ERROR_ILLEGAL_VALUE) [nsIDOMWindowUtils.sendTouchEvent] WORKSFORME -- [fxosqa-auto-backlog+]
1105168 Update insert_call_entry method to remove time.sleep() -- [fxosqa-auto-backlog+]
1105787 Viorela Ioia [:viorela] Fix intermittent failure in test_sms_contact.py FIXED -- [fxosqa-auto-s5]
1106033 Robert Chira [:RobertC] [v2.1] Fix test_ftu_skip_tour failure FIXED -- [fxosqa-auto-s5]
1106765 Intermittent test_a11y_phone_select_toolbars.py TestAccessibilityPhoneSelectToolbars.test_phone_select_toolbars | JavascriptException: JavascriptException: TypeError: Argument 1 of Window.getComputedStyle is not an object. WONTFIX -- [fxosqa-auto-backlog-]
1107005 Robert Chira [:RobertC] [v2.2] Disable test_call_log_all_calls.py due to Bug 1096385 FIXED -- [fxosqa-auto-s5+]
1107086 Robert Chira [:RobertC] [v2.2] Fix test_sms_with_attachments.py failure FIXED -- [fxosqa-auto-s5+]
1107460 Robert Chira [:RobertC] [v2.2] Update marionette version to 0.8.5 FIXED -- [fxosqa-auto-s5+]
1107665 test_marketplace_launch.py should be external=true FIXED -- [fxosqa-auto-backlog+]
1107920 [v2.2] Investigate test_capture_multiple_shots failure -- [fxosqa-auto-backlog+]
1107926 Florin Strugariu [:Bebe] Update cost_control app object to reflect changes in Bug 1089968 FIXED -- [fxosqa-auto-s6]
1108030 Zibi Braniecki [:gandalf][:zibi] [Bluetooth] Unable to send files via bluetooth FIXED -- [QAnalyst-Triage+][fxosqa-auto-backlog+]
1108534 Johan Lorenzo [:jlorenzo] test_delete_call_log should use a hard-coded phone, not remote_phone_number FIXED -- [fxosqa-auto-s6][fxosqa-auto-points=1]
1108576 Zac C (:zac) Experiment with methods to speed up the keyboard's send() method -- [fxosqa-auto-backlog+]
1109099 Robert Chira [:RobertC] [v2.2] Add test to check that calls are grouped by phone number and day FIXED -- [fxosqa-auto-s6]
1109203 current_audio_channel getter switches context to the system app, but doesn't return it back to the visible app WONTFIX -- [fxosqa-auto-backlog+]
1109213 Martijn Wargers (dead) test_sms_with_attachments.py: "NoSuchWindowException: NoSuchWindowException: None" FIXED -- [QAnalyst-Triage+][fxosqa-auto-s7]
1109586 Florin Strugariu [:Bebe] Write test to check the Contacts App checks and notifies the user when no network is available during a import contacts app FIXED -- [fxosqa-auto-s6]
1109587 Florin Strugariu [:Bebe] New test that Import's a contact from SIM, edit it and export it again FIXED -- [fxosqa-auto-s6]
1109601 Johan Lorenzo [:jlorenzo] Add a test to check contact's photo when having an active call and receiving a new incoming call WONTFIX -- [fxosqa-auto-dropped-s6][fxosqa-auto-points=3]
1109606 Johan Lorenzo [:jlorenzo] Add a test to check that a miss call notification is cleared even if a voicemail notification is present FIXED -- [fxosqa-auto-s6][fxosqa-auto-points=3]
1110099 Viorela Ioia [:viorela] Add a test to check the ability to return from the Camera App to the Gallery app after taking a photo DUPLICATE -- [fxosqa-auto-s6]
1110102 [v2.2] Add test to verify that the video recording stops immediately when going to homescreen -- [fxosqa-auto-from-s6] [fxosqa-auto-dropped-s7] [fxosqa-auto-backlog+]
1110103 Viorela Ioia [:viorela] Add a test to share a single photo from gallery, Multiple Selection Mode FIXED -- [fxosqa-auto-s6]
1110169 Florin Strugariu [:Bebe] Intermittent test_dialer_add_contact.py TestDialerAddContact.test_dialer_add_contact | TimeoutException: TimeoutException: Timed out after 10.1 seconds FIXED -- [fxosqa-auto-s8]
1110218 Viorela Ioia [:viorela] Investigate intermittent failure in test_redial_last_number.py WORKSFORME -- [fxosqa-auto-s6]
1111519 Viorela Ioia [:viorela] Update locators in Device info page FIXED -- [fxosqa-auto-s6]
1111637 No-Jun Park [:njpark] Create a new test case for the switching to camera from gallery and back FIXED -- [fxosqa-auto-s6]
1111734 Remove usage of player.show_controls in test_browser_play_video.py WONTFIX -- [fxosqa-auto-backlog+]
1111981 Robert Chira [:RobertC] [v2.2] Investigate intermittent failure in test_sms_with_picture_attached.py and test_add_photo_to_contact.py FIXED -- [fxosqa-auto-from-s6] [fxosqa-auto-from-s7] [fxosqa-auto-from-s8] [fxosqa-auto-s9]
1112141 Martijn Wargers (dead) Intermittent test_homescreen_delete_app_packaged.py TestDeleteApp.test_delete_app | StaleElementException: StaleElementException: The element reference is stale. Either the element is no longer attached to the DOM or the page has been refreshed. FIXED -- [fxosqa-auto-s8]
1112146 Intermittent test_browser_bookmark.py TestBrowserBookmark.test_browser_bookmark | ElementNotVisibleException: ElementNotVisibleException: Element is not currently visible and may not be manipulated and a bunch more afterwards -- [fxosqa-auto-backlog+]
1112191 Johan Lorenzo [:jlorenzo] Add a test to check that touchtones are responsive during phonecall WONTFIX -- [fxosqa-auto-dropped-s7][fxosqa-auto-s8][fxosqa-auto-points=8]
1112227 No-Jun Park [:njpark] Create a new test case for the multi-file deletion in gallery app FIXED -- fxosqa-auto-s6
1112334 Martijn Wargers (dead) Write a test for basic Find My Device logging in existing account FIXED -- [fxosqa-auto-from-s6][fxosqa-auto-s7][fxosqa-auto-points=4]
1112583 Viorela Ioia [:viorela] Add a test to verify that a received call notification is deleted when the SMS is deleted FIXED -- [fxosqa-auto-dropped-s6][fxosqa-auto-s9]
1112758 No-Jun Park [:njpark] Create a new test case for the switching to camera from gallery's list view FIXED -- [fxosqa-auto-s6]
1112824 No-Jun Park [:njpark] Create a new test case for the restricted access status of FM Radio under airplane mode FIXED -- [fxosqa-auto-s6]
1113154 Johan Lorenzo [:jlorenzo] Plivo sometimes raises a 404 error just after the call has been created FIXED -- [fxosqa-auto-s7]
1113188 Johan Lorenzo [:jlorenzo] Add a test to check deletion of multiple contacts FIXED -- [fxosqa-auto-s7][fxosqa-auto-points=2]
1113482 Alberto Pastor [:albertopq] Statusbar is missing from FTU FIXED -- [QAnalyst-Triage+][fxosqa-auto-backlog+]
1113662 Viorela Ioia [:viorela] [v2.2] Investigate test_sms_with_attachments tap_capture failure FIXED -- [fxosqa-auto-from-s7][fxosqa-auto-s8]
1113762 Martijn Wargers (dead) Add videos with counters to gaia-ui tests FIXED -- [fxosqa-auto-s7][fxosqa-auto-points=4]
1113851 Florin Strugariu [:Bebe] [Settings] Change time format to 24-hour, write gaia-ui test FIXED -- [fxosqa-auto-s7]
1113853 [Keyboard][VisualRefresh] Multi touch behavior when typing (Two characters), write a gaia-ui test for it WONTFIX -- [fxosqa-auto-backlog+]
1113953 Johan Lorenzo [:jlorenzo] Bug 1097754 Follow up - Centralizing the default Plivo timeout value FIXED -- [fxosqa-auto-s7][fxosqa-auto-points=1]
1114559 Johan Lorenzo [:jlorenzo] Add a test to check the presence of contacts' default image FIXED -- [fxosqa-auto-s7][fxosqa-auto-points=2]
1114560 Johan Lorenzo [:jlorenzo] Add a test to delete the whole phone number on the dialer FIXED -- [fxosqa-auto-s7][fxosqa-auto-points=2]
1114568 Johan Lorenzo [:jlorenzo] Add a test to check that a regular phone number should not be dialed out on the emergency dialer FIXED -- [fxosqa-auto-s7][fxosqa-auto-points=6]
1114640 No-Jun Park [:njpark] Create a new test case for the rating feature of the Music App FIXED -- [fxosqa-auto-s7]
1114643 No-Jun Park [:njpark] Create a new test case for cancelling the deletion of multiple photos in gallery FIXED -- [fxosqa-auto-s7]
1114653 Intermittent test_a11y_calendar_month_view_select_event.py TestCalendarMonthViewSelectEventAccessibility.test_a11y_calendar_month_view_select_event | StaleElementException: StaleElementException: The element reference is stale. Either the element is no... DUPLICATE -- [fxosqa-auto-backlog-]
1114958 Florin Strugariu [:Bebe] Add sanity tag to a test that connects to cell data FIXED -- [fxosqa-auto-s8]
1115026 Florin Strugariu [:Bebe] Write test to check Bug 1113482 FIXED -- [fxosqa-auto-s7]
1115180 Martijn Wargers (dead) Get test_cost_control_data_alert_mobile.py re-enabled FIXED -- [fxosqa-auto-s7][fxosqa-auto-points=4]
1115799 [Browser] Check the menu window to verify that the Add to Homescreen option no longer exists after adding a bookmark to the homescreen -- [fxosqa-auto-backlog+]
1115905 Several functions in gaia_test.py switch context to the system app unnecessarily WONTFIX -- [fxosqa-auto-backlog+]
1116076 Robert Chira [:RobertC] [v2.2] Fix test_rocketbar_add_collection failure FIXED -- [fxosqa-auto-s7]
1116172 Write a gaia UI test for " UI highlights the matched wording" WONTFIX -- [fxosqa-auto-backlog+]
1116173 Write a gaia UI test for moztrap test "As a user, I want to easily move the input cursor so that I can insert or delete text at any point" WONTFIX -- [fxosqa-auto-backlog+]
1116175 Martijn Wargers (dead) Write a gaia UI test for moztrap test "Share a music as a ringtone - Use as default ringtone" FIXED -- [fxosqa-auto-s8]
1116183 Write a gaia UI test for moztrap test "Select MPEG-3 audio file(.mp3) from SD card as ringtone" WONTFIX -- [fxosqa-auto-s8]
1116184 Write a gaia UI test for moztrap test "Create a Custom Ringtone in Settings" WONTFIX -- [fxosqa-auto-s8]
1116186 Write a gaia UI test for moztrap test " save and view received image, audio or video attachments from mail" WONTFIX -- [fxosqa-auto-backlog+]
1116456 Martijn Wargers (dead) [v2.2] Investigate test_marketplace_packaged_app.py failure FIXED -- [fxosqa-auto-s7][fxosqa-auto-points=4]
1116481 [Find My Device] Write a test for Find My Device new account WONTFIX -- [fxosqa-auto-points=8][fxosqa-auto-s8]
1116566 Martijn Wargers (dead) Create test to catch regression in bug 1116087 FIXED -- [fxosqa-auto-backlog+][fxosqa-auto-s7][fxosqa-auto-points=4]
1116744 [v2.2] Investigate test_toggle_bluetooth_settings intermittent failure on Jenkins -- [fxosqa-auto-from-s7] [fxosqa-auto-from-s8] [fxosqa-auto-dropped-s9] [fxosqa-auto-backlog+]
1117115 Johan Lorenzo [:jlorenzo] Enable test_settings_sim_manager.py FIXED -- [fxosqa-auto-s7+][fxosqa-auto-points=1]
1117784 Martijn Wargers (dead) Investigate test_persona_standard_sign_in intermittent failure FIXED -- [fxosqa-auto-s8]
1117804 Investigate test_call_log_groups failure -- [fxosqa-auto-from-s6] [fxosqa-auto-from-s7] [fxosqa-auto-from-s8] [fxosqa-auto-dropped-s9]
1117813 Johan Lorenzo [:jlorenzo] Make PlivoUtil use a valid 'answer_url' with a valid Plivo XML WONTFIX -- [fxosqa-auto-s8][fxosqa-auto-points=2]
1117823 Viorela Ioia [:viorela] Update locators in Settings - Cell data page FIXED -- [fxosqa-auto-s7]
1118054 No-Jun Park [:njpark] Create test to catch regression in bug 1117981 - Lockscreen doesn't show updated time after being woken up from sleep FIXED -- [fxosqa-auto-backlog+]
1118219 Martijn Wargers (dead) Remove bluetooth host checking in test_toggle_bluetooth_settings FIXED -- [fxosqa-auto-backlog+]
1118331 Johan Lorenzo [:jlorenzo] Miss call notification sometimes appears twice test_dialer_clear_miss_call_notification.py WONTFIX -- [fxosqa-auto-dropped-s8]
1118537 html5_player::HTML5Player::is_playing() is incomplete per HTML5 Video spec -- [fxosqa-auto-s8]
1118728 Florin Strugariu [:Bebe] Update Phone app object to wait for the app to launch FIXED -- [fxosqa-auto-s7]
1119143 Robert Chira [:RobertC] [v2.2] Fix rocketbar test failures FIXED -- [fxosqa-auto-s7+]
1119278 Robert Chira [:RobertC] Intermittent test_music_change_rating.py TestSetMusicRating.test_music_change_rating | ValueError: time data u'' does not match format '%M:%S' FIXED -- [fxosqa-auto-from-s7] [fxosqa-auto-s8]
1119404 Write test to check Bug 1117981 - Lockscreen doesn't show updated time after being woken up from sleep DUPLICATE -- [fxosqa-auto-backlog+]
1119806 Martijn Wargers (dead) Intermittent test_power_button_long_press.py TestPowerButton.test_power_button_long_press | ScriptTimeoutException: ScriptTimeoutException: timed out WORKSFORME -- [fxosqa-auto-s8]
1120329 Florin Strugariu [:Bebe] Intermittent test_ftu_status_bar.py TestFtu.test_ftu_status_bar | TimeoutException: TimeoutException: Timed out after 10.0 seconds FIXED -- [fxosqa-auto-s8]
1120479 Robert Chira [:RobertC] Xfail test_call_log_groups because of Bug 1117804 FIXED -- [fxosqa-auto-s8]
1120483 Martijn Wargers (dead) Add some explanation comments to test_browser_play_video.py WONTFIX -- [fxosqa-auto-s8]
1120925 Robert Chira [:RobertC] The gmail account password needs to be updated FIXED -- [fxosqa-auto-s8+]
1120926 Florin Strugariu [:Bebe] Update StatusBar page object to use the minimized and maximized status bars FIXED -- [fxosqa-auto-s8]
1120941 Viorela Ioia [:viorela] Investigate test_ftu_skip_tour intermittent failure FIXED -- [fxosqa-auto-s8]
1121405 Florin Strugariu [:Bebe] Update CI devices with the V18D-1 base build FIXED -- [fxosqa-auto-s8]
1121974 Viorela Ioia [:viorela] Fix intermittent failure in test_settings_wifi.py, improve wait before typing the password FIXED -- [fxosqa-auto-s8]
1121978 Test test_keyboard_predictive_key.py is failing intermittently, wrong predictive word is selected -- [fxosqa-auto-from-s8][fxosqa-auto-s9][QAnalyst-Triage+][fxosqa-auto-backlog?]
1121979 Florin Strugariu [:Bebe] Remove locators from test_gallery_edit_photo.py FIXED -- [fxosqa-auto-s8]
1122448 Viorela Ioia [:viorela] Intermittent test_sms_auto_save_draft.py TestSmsAutoSaveDrafts.test_sms_auto_save_draft | IndexError: list index out of range WORKSFORME -- [fxosqa-auto-from-s8][fxosqa-auto-s9]
1122451 Florin Strugariu [:Bebe] Enable test_lockscreen_unlock_to_camera_with_passcode.py FIXED -- [fxosqa-auto-s8][fxosqa-auto-points=1]
1123652 Johan Lorenzo [:jlorenzo] Disable test_dialer_set_up_conference_call.py due to Bug 1117813 FIXED -- [fxosqa-auto-s8][fxosqa-auto-points=1]
1124160 Florin Strugariu [:Bebe] Xfail camera tests because of Bug 1124139 FIXED -- [fxosqa-auto-s8]
1124725 Robert Chira [:RobertC] Unxfail camera tests FIXED -- [fxosqa-auto-s8+]
1124968 Intermittent test_gallery_share_picture.py TestGallerySharePicture.test_gallery_share_to_messages | ScriptTimeoutException: ScriptTimeoutException: timed out WONTFIX -- [fxosqa-auto-backlog+]
1125267 Intermittent est_a11y_calendar_views_visibility.py TestCalendarViewsVisibilityAccessibility.test_a11y_calendar_views_visibility | ScriptTimeoutException: ScriptTimeoutException: timed out WORKSFORME -- [fxosqa-auto-backlog-]
1125759 Intermitent unit test TestKill_test_kill_multiple -- [fxosqa-auto-backlog+]
1125798 Robert Chira [:RobertC] Investigate camera switch source failure on automation -- [fxosqa-auto-s9]
1126775 Investigate test_browser_save_image failure -- [fxosqa-auto-dropped-s9] [fxosqa-auto-backlog+]
1127266 Viorela Ioia [:viorela] Update test_rocketbar_search.py according to changes in Bug 1117770 FIXED -- [fxosqa-auto-s9]
1127762 Viorela Ioia [:viorela] Fix intermittent failure in test_music_change_rating.py FIXED -- [fxosqa-auto-s9]
1127856 Viorela Ioia [:viorela] Update test_gallery_switch_to_camera.py according to changes in Bug 1068973 FIXED -- [fxosqa-auto-s9]
1128553 Florin Strugariu [:Bebe] Use the smtp.mozilla.com host for sending e-mails FIXED -- [fxosqa-auto-s9]
1128557 Investigate false positive in test_unlock_to_homescreen_with_passcode -- [fxosqa-auto-backlog+]
1128841 Intermittent test_browser_search.py TestBrowserSearch.test_browser_search | ScriptTimeoutException: ScriptTimeoutException: timed out FIXED -- [fxosqa-auto-backlog+]
1128843 Intermittent test_browser_clear_browsing_history.py TestBrowserClearHistory.test_browser_clear_history | TimeoutException: TimeoutException: Timed out after 10.0 seconds with message: Keyboard inputWindow not interpreted as displayed. Debug is_displayed() WONTFIX -- [fxosqa-auto-backlog+]
1128952 Viorela Ioia [:viorela] Use more precise actions when selecting values from the timepicker FIXED -- [fxosqa-auto-s9]
1129016 Viorela Ioia [:viorela] Investigate failure in test_settings_do_not_track.py FIXED -- [fxosqa-auto-s9]
1129019 test_IMAP_email_notification.py is failing intermittently, email notification is not received before timeout -- [fxosqa-auto-backlog+]
1129337 Geo Mealer [:geo] -- This account is inactive after 2015-07-07 b2g-28.1 cannot be found via ADB FIXED -- fxosqa-auto-s11+
1129411 Failure in test_calendar_new_event_appears_on_all_calendar_views.py, Add event button is not tapped DUPLICATE -- [fxosqa-auto-backlog+]
1129762 Write a gaia-ui test for regression bug 1129526 WONTFIX -- [fxosqa-auto-backlog+]
1129952 Investigate failure in test_homescreen_delete_app_packaged.py, packaged app fails to install -- [fxosqa-auto-backlog+]
1130391 Robert Chira [:RobertC] Fix locators in more information view in the settings app FIXED -- [fxosqa-auto-backlog+]
1130942 [v2.2] Investigate test_marketplace_packaged_app.py failure FIXED -- [fxosqa-auto-backlog+]
1130990 Viorela Ioia [:viorela] Update geolocation checkbox locator in FTU app FIXED -- [fxosqa-auto-s9]
1130995 Geo Mealer [:geo] -- This account is inactive after 2015-07-07 b2g-07.1 cannot be found via adb FIXED -- fxosqa-auto-s11+
1131022 Martijn Wargers (dead) Investigate mozIccManager is undefined test failures FIXED -- [fxosqa-auto-backlog+]
1131070 Martijn Wargers (dead) Investigate test_toggle_airplane_mode intermittent failure FIXED -- [fxosqa-auto-backlog+]
1131795 [Windows Management] The callscreen will time-out after 10 seconds when answering a phone call from the lockscreen; ignoring screen timeout settings. INVALID -- [fxosqa-auto-backlog?][QAnalyst-Triage+]
1132479 Martijn Wargers (dead) Fix test_IMAP_email_notification failure FIXED -- [QAnalyst-Triage+][fxosqa-auto-s11]
1133810 test_fmradio_frequency_dialer failing to scroll/flick -- [QAnalyst-Triage+][fxosqa-auto-backlog?]
1134244 No-Jun Park [:njpark] test_settings_bluetooth.py:test_toggle_bluetooth_settings is failing on bluetooth_settings.enable_visible_to_all() FIXED -- [QAnalyst-Triage+][fxosqa-auto-backlog?]
1134257 Geo Mealer [:geo] -- This account is inactive after 2015-07-07 test_ftu_skip_tour should reflect new Send Data initial state and separate SIM- and network-available conditions FIXED -- [QAnalyst-Triage+][fxosqa-auto-sprint-10]
1136774 Johan Lorenzo [:jlorenzo] Reduce Handoffs: Revision of plan for minimized execution/triage process FIXED -- [fxosqa-auto-from-s11][fxosqa-auto-s12]
1136779 Johan Lorenzo [:jlorenzo] Criteria document for picking Gaia Integration tests to automate FIXED -- [fxosqa-auto-s11]
1136791 Martijn Wargers (dead) test_marketplace_packaged_app times out after opening Marketplace, unable to search FIXED -- [QAnalyst-Triage+][fxosqa-auto-backlog?]
1137766 Error in both test_settings_change_language tests: exception "Element '%s' could not be foundin select wrapper" FIXED -- [QAnalyst-Triage+][fxosqa-auto-backlog?]
1137787 Geo Mealer [:geo] -- This account is inactive after 2015-07-07 Xfail test_ftu_skip_tour pending resolution of Bug 1134445 FIXED -- [fxosqa-auto-s11]
1138465 Geo Mealer [:geo] -- This account is inactive after 2015-07-07 b2g-28.1 failed to be found; no report generated for mozilla-central-nightly.smoke FIXED -- fxosqa-auto-s11+
1138505 Improve failure analysis tool to add time-based analysis -- [fxosqa-auto-s11, s12, s13]
1138509 Geo Mealer [:geo] -- This account is inactive after 2015-07-07 Draft: Language-agnostic best practices document for automation FIXED -- [fxosqa-auto-from-s11] [fxosqa-auto-s12]
1138513 Draft of Gaia UI Test harness behavior -- [fxosqa-auto-s11, s12, s13]
1138517 Martijn Wargers (dead) test_inbox_to_settings.py failing consistently, element not visible exception FIXED -- [QAnalyst-Triage+][fxosqa-auto-backlog?]
1138539 Draft process/ownership diagram of current process from build to results WONTFIX -- [fxosqa-auto-s13][fxosqa-auto-from-s11][fxosqa-auto-from-s12]
1138540 Criteria document for picking Acceptance tests to automate WONTFIX -- [fxosqa-auto-s13][fxosqa-auto-from-s11][fxosqa-auto-from-s12]
1138542 Martijn Wargers (dead) Draft report on MarionetteJS on-device status FIXED -- [fxosqa-auto-s12][fxosqa-auto-from-s11]
1138546 John Dorlus [:Silne30] New Hire Document for Firefox OS FIXED -- [fxosqa-auto-s11]
1139054 John Dorlus [:Silne30] Python Gaia UI Test Tutorial Fixes FIXED -- [fxosqa-auto-from-s11] [fxosqa-auto-s12]
1139083 John Dorlus [:Silne30] Implement Brick Verification Test in Python FIXED -- [fxosqa-auto-from-s11+, s12, s13]
1139215 test_launch_l10n.py:test_launch_by_localised_name consistently fails on-device -- [fxosqa-auto-s11+]
1139486 test_sms_auto_save_draft.py failing consistently WORKSFORME -- [QAnalyst-Triage+][fxosqa-auto-backlog?]
1139921 Johan Lorenzo [:jlorenzo] Assist with Gaia Integration: Analysis of Acceptance tests for additional Gaia Integration possibilities FIXED -- [fxosqa-auto-s11]
1139999 Martijn Wargers (dead) Re-enable tests on linux debug b2g desktop that were disabled by bug 1103106 FIXED -- [fxosqa-auto-s11]
1140017 test_dialer_clear_miss_call_notification.py is timing out after receiving the missed call. -- [QAnalyst-Triage+][fxosqa-auto-backlog?]
1140027 test_lockscreen_time_check.py intermittently fails checking the time at the lockscreen. WORKSFORME -- [QAnalyst-Triage+][fxosqa-auto-backlog?]
1140039 test_sms_to_dialer.py is intermittently failing with a timeout. WORKSFORME -- [QAnalyst-Triage+][fxosqa-auto-backlog?]
1140588 John Dorlus [:Silne30] Added Xfail and Disable Tests Document FIXED -- [fxosqa-auto-s11+]
1140669 Geo Mealer [:geo] -- This account is inactive after 2015-07-07 Xfail the test_settings_change_language* tests due to bug 1137766 FIXED -- fxosqa-auto-s11+
1141124 Geo Mealer [:geo] -- This account is inactive after 2015-07-07 Disable test_settings_bluetooth.py:test_toggle_bluetooth_settings FIXED -- fxosqa-auto-s11+
1141654 test_settings_change_time_format consistently failing, seems to hang and fail on the homescreen FIXED -- [QAnalyst-Triage+][fxosqa-auto-backlog?]
1141670 Martijn Wargers (dead) Intermittent failure in test_sms_contact.py INVALID -- [QAnalyst-Triage+][fxosqa-auto-backlog?]
1142339 Geo Mealer [:geo] -- This account is inactive after 2015-07-07 Document bug filing standards against automation reports FIXED -- [fxosqa-auto-s12]
1142621 test_import_edit_export_contact.py failed with AssertionError: u'Name2129' != u'Name2129 New' -- [QAnalyst-Triage+][fxosqa-auto-backlog+]
1142622 test_sms_notification.py failed with IOError: Connection to Marionette server is lost. Check gecko.log (desktop firefox) or logcat (b2g) for errors. -- [QAnalyst-Triage+][fxosqa-auto-backlog+]
1143684 b2g-28.1 was not found by ADB FIXED -- [QAnalyst-Triage?][fxosqa-auto-backlog?]
1143716 Martijn Wargers (dead) test_delete_call_log::test_delete_call_log() failed with AssertionError: 'Edit' != u'' FIXED -- [QAnalyst-Triage+][fxosqa-auto-backlog?]
1144809 John Dorlus [:Silne30] Create Plan for Firefox OS QA Automation Community FIXED -- [fxosqa-auto-from-s11+][fxosqa-auto-s12]
1145657 John Dorlus [:Silne30] Create View Pattern for use in Gaia Acceptance WONTFIX -- [fxosqa-auto-s12+,s13,s14,s15,s16,s17]
1145875 Geo Mealer [:geo] -- This account is inactive after 2015-07-07 Random tests failing with JavascriptException: TypeError: this.element is null in app://system.gaiamobile.org/gaia_build_defer_index.js line: 2337 or .../app_window.js line:451 FIXED -- [fxosqa-auto-s12+, s13]
1146909 Johan Lorenzo [:jlorenzo] Develop Gaia Acceptance: Establish Gaia Acceptance backlog with existing Python UI tests to port FIXED -- [fxosqa-auto-s13]
1146917 Johan Lorenzo [:jlorenzo] Port Gaia Integration Python: Division of existing Gaia Integration Python tests by functional team FIXED -- [fxosqa-auto-s13]
1148453 Test errors when connecting to Wi-Fi: "self.connect_to_local_area_network()" FIXED -- [QAnalyst-Triage+][fxosqa-auto-backlog?]
1149202 test_gallery_flick.py: "TimeoutException: TimeoutException: Timed out after 20.1 seconds" FIXED -- [QAnalyst-Triage+][fxosqa-auto-backlog?]
1149207 test_music_artist_mp3.py: "NoSuchElementException: NoSuchElementException: Unable to locate element: span.list-song-index" DUPLICATE -- [QAnalyst-Triage+][fxosqa-auto-backlog?]
1149210 test_music_album_mp3.py: "NoSuchElementException: NoSuchElementException: Unable to locate element: span.list-song-index" DUPLICATE -- [QAnalyst-Triage+][fxosqa-auto-backlog?]
1149224 test_calendar_flick_through_months.py: "TimeoutException: TimeoutException: Timed out after 20.1 seconds" FIXED -- [QAnalyst-Triage+][fxosqa-auto-backlog?]
1150537 Johan Lorenzo [:jlorenzo] Document the differences between the raw engineering builds and the ones published FIXED -- [fxosqa-auto-s13+]
1150573 Martijn Wargers (dead) test_play_3gp_video.py: "JavascriptException: JavascriptException: unload was called" x3 tests { 3gp, ogg, ogv } FIXED -- [QAnalyst-Triage+][fxosqa-auto-backlog?]
1150913 Martijn Wargers (dead) test_rocketbar_add_collection_save_bookmark.py: "TimeoutException: TimeoutException: Timed out after 20.0 seconds" FIXED -- [QAnalyst-Triage+][fxosqa-auto-backlog?]
1150920 Martijn Wargers (dead) test_dialer_miss_call_from_known_contact_notification.py: " IndexError: list index out of range " FIXED -- [QAnalyst-Triage+][fxosqa-auto-backlog?]
1151902 Martijn Wargers (dead) test_dialer_find_contact.py: "IndexError: list index out of range" FIXED -- [QAnalyst-Triage+][fxosqa-auto-backlog?]
1153917 Sam Foster [:sfoster] Missing strings when importing contacts in the FTU WORKSFORME P2 [QAnalyst-Triage+][fxosqa-auto-backlog-]
1156332 Implement Brick Test in JavaScript WONTFIX -- [fxosqa-auto-s14+,s15,s16,s17]
1156753 Johan Lorenzo [:jlorenzo] Migrate test_sms_to_dialer.py to Gij FIXED -- [fxosqa-auto-s15,s16,s17]
1156843 Create PoC for Gaia Acceptance suite based on MarionetteJS -- [fxosqa-auto-s15,16,17]
1157316 Martijn Wargers (dead) test_lockscreen_time_check.py: " JavascriptException: TypeError: document.getElementById(...) is null " FIXED -- [QAnalyst-Triage+][fxosqa-auto-backlog?]
1157772 Martijn Wargers (dead) test_rocketbar_offline_behavior.py: "TimeoutException: Timed out after 29.9 seconds with message: Keyboard inputWindow not interpreted as displayed. Debug is_displayed(): False, class: inputWindow." FIXED -- [QAnalyst-Triage+][fxosqa-auto-backlog?]
1159352 Martijn Wargers (dead) test_play_mp4_video.py: " AssertionError: 'content' != u'none' " FIXED -- [QAnalyst-Triage+][fxosqa-auto-backlog?]
1159787 Martijn Wargers (dead) test_marketplace_packaged_app.py: " TimeoutException: TimeoutException: Timed out after 20.1 seconds " FIXED -- [QAnalyst-Triage+][fxosqa-auto-backlog?]
1161088 Martijn Wargers (dead) test_add_photo_to_contact.py: " MarionetteException: MarionetteException: Error sending message to frame (NS_ERROR_NOT_INITIALIZED) " FIXED -- [QAnalyst-Triage+][fxosqa-auto-backlog?]
1162112 test_rocketbar_add_collection_save_bookmark.py: " TimeoutException: TimeoutException: Timed out after 30.1 seconds " WORKSFORME -- [QAnalyst-Triage+][fxosqa-auto-backlog?]
1164073 Martijn Wargers (dead) test_system_notification_bar.py: "AssertionError: Expected one notification." FIXED -- [QAnalyst-Triage+][fxosqa-auto-backlog?]
1165026 Geo Mealer [:geo] -- This account is inactive after 2015-07-07 Disable test_launch_l10n.py FIXED -- fxosqa-auto-s16+
1165937 Create set of sanity tests to qualify device/envs for MarionetteJS acceptance tests -- [fxosqa-auto-s16,17]
1167688 Martijn Wargers (dead) test_persona_app.py: "AssertionError: 'app://uitest.gaiamobile.org' != u'app://uitest.gaiamobile.org!appId=1058'" FIXED -- [QAnalyst-Triage+][fxosqa-auto-backlog?]
1168118 Johan Lorenzo [:jlorenzo] Migrate test_sms_contact_input_validation.py to Gij FIXED -- [fxosqa-auto-s17+,s18]
1168324 Johan Lorenzo [:jlorenzo] Migrate test_sms_contact_match.py to Gij FIXED -- [fxosqa-auto-s18]
1168448 Martijn Wargers (dead) test_homescreen_column_layout.py: "TypeError: int() argument must be a string or a number, not 'NoneType'" FIXED -- [QAnalyst-Triage+][fxosqa-auto-backlog?]
1168876 Martijn Wargers (dead) test_system_notification_bar.py: "ElementNotVisibleException: Element is not currently visible and may not be manipulated" FIXED -- [QAnalyst-Triage?][fxosqa-auto-backlog?]
1171231 test_setup_and_send_imap_email.py: assert self.device.is_online AssertionError -- [QAnalyst-Triage?][fxosqa-auto-backlog?]
1175108 Johan Lorenzo [:jlorenzo] Migrate test_sms_semicolon_completes_the_entered_recipient.py to Gij FIXED -- [fxosqa-auto-s19]
1175110 Johan Lorenzo [:jlorenzo] Disable SMS Gip tests that have been migrated to Gij FIXED -- [fxosqa-auto-s19]

376 Total; 53 Open (14.1%); 317 Resolved (84.31%); 6 Verified (1.6%);


Other


Sprint Notes

template