Releases/Firefox 29/Test Plan

From MozillaWiki
Jump to: navigation, search

« Firefox 28 | Firefox 29 | Firefox 30 »

Firefox 29 Test Plan

QA Lead: Juan Becerra

Schedule

  • 2013.12.09: Nightly
  • 2014.02.03: Aurora
  • 2014.03.14: Pre-Beta feature sign-offs
  • 2014.03.20: Beta 1
  • 2014.03.25: Beta 2
  • 2014.03.27: Beta 3
  • 2014.04.01: Beta 4
  • 2014.04.03: Beta 5
  • 2014.04.08: Beta 6
  • 2014.04.10: Beta 7
  • 2014.04.15: Beta 8
  • 2014.04.17: Beta 9
  • 2014.04.22: Beta 10
  • 2014.04.23: Release Candidate
  • 2014.04.29: Final

Features

Disabled

The following features have been deemed not ready for release and will be delayed to Firefox 30 or later.

On Track

Signed Off

The following features have no blockers and have been deemed ready for release.


Nightly

Fixed Bugs

How to Help
  • Download and install the latest Firefox Nightly
  • Load this list of bug reports
  • Read each bug report until you find one you understand and want to test
  • Download and install the version of Firefox used to report the bug
  • Using the older build, test the claim made in the bug report to see if you can reproduce it
    • If you cannot reproduce the bug move on to another bug or ask the reporter to verify the fix
  • Using the latest Nightly, test to see if you can reproduce the bug
    • If you cannot reproduce the bug set the STATUS to VERIFIED FIXED and add a comment describing your testing
    • If you can still reproduce the bug set the STATUS to REOPENED and add a comment describing your testing
  • Add any bug reopened to the list below using the bug number template (verified fixes will be tracked elsewhere)
  • If you need help, send email to Anthony Hughes with the bug summary in the Subject field
Reopened Bugs

Reported Bugs

Triage unconfirmed bugs.

How to Help
  • Download and install the latest Firefox Nightly
  • Load this list of bug reports
  • Read each bug report until you find one you understand and want to test
  • Test the claim made in the bug report and see if you can reproduce it
  • If you can reproduce the bug, set the STATUS to NEW, add a comment describing your testing, and try to find a regression window
  • Any confirmed bugs should be added to the list below using the bug number template
  • If you need help, send email to Anthony Hughes with the bug summary in the Subject field
Confirmed Bugs

Stability

How to Help
  • Review the Firefox 29 Explosiveness Report
    • Any signatures rising significantly (>= 2.0 explosiveness rating) without a bug number should be reported to Bugzilla and nominated for tracking
    • If there is already a bug report, update the report with the latest numbers
    • Ensure the bug report has the topcrash-platform keyword added (where platform is the platform where crashes occur -- ie. topcrash-win for Windows)
    • Ensure the bug is listed below using the bug number template
  • Review the Firefox 29 Topcrash Report
    • Any signature in the top 10 without a bug number should be reported to Bugzilla and nominated for tracking
    • If there is already a bug report, update the report with the latest ranking information
    • Ensure the bug report has the topcrash-platform keyword added (where platform is the platform where crashes occur -- ie. topcrash-win for Windows)
    • Ensure the bug is listed below using the bug number template
  • Review the Firefox 29 tracked bugs that aren't tracked in 28 or 27.
    • Each bug listed needs to have its rank updated once per week
    • Use the topcrash reports from crash-stats to get the rank for each branch
    • Add this information to the bug report
    • Ensure the bug report has the topcrash-platform keyword added (where platform is the platform where crashes occur -- ie. topcrash-win for Windows)
    • Conversely, remove the topcrash keyword if the crash is no longer in the top-10
  • For each of these tasks, ensure the etherpad is updated with your name and the date checked
Topcrash Bugs

QA Wanted

How to Help
  • Download and install the latest Firefox Nightly
  • Review this list of bug reports to find a bug you both understand and want to test (each should contain a comment detailing what's needed from QA)
    • If the bug needs steps to reproduce, try to find a reproducible set of steps
    • If the bug needs a regression window, try to find a regression window
    • If the bug is fixed and needs verification, test to confirm you can reproduce the bug on an older build but not the latest build
  • Any tested bugs should be added to the list below using the bug number template
  • Remove the qawanted keyword from any fulfilled request
  • If you need help, send email to Anthony Hughes with the bug summary in the Subject field
Tested Bugs

Testdays

Aurora

Branch Migration

Pre Sign-off Tasks

  • {{|}} Firefox branch migrated (Release Management)
  • {{|}} Mozmill Tests branch migrated (Automation Development)
  • {{|}} Updates throttled on aurora channel (Release Engineering)
  • {{|}} Updates verified throttled on aurora channel (QA)

Sign-off Tasks

  • {{|}} Mozmill Daily functional testruns pass with no failures ([report])
  • {{|}} Mozmill Daily auroratest update testruns pass with no failures ([report])
  • {{|}} Scope features tested and signed off for Aurora uplift
Features (feature tracking)
Feature Owner Documentation Aurora Merge Sign-off
Australis Cornel Ionce wiki page [DONE]
New First Run experience Catalin Varga tracking bug [DONE]
Firefox Accounts Tracy Walker wiki page [ON TRACK]
Disallow enumeration of navigator.plugins Catalin Varga tracking bug [DONE]
Fix common scheme typos Petruta Rasa tracking bug [DONE]

Post Sign-off Tasks

  • Aurora sign-off email sent (QA)
  • Updates unthrottled on aurora channel (Release Engineering)
  • Updates verified unthrottled on aurora channel (QA)

Beta

Regression Testing

  • Run these tests for whatever platform(s) you have available.
  • Report a bug if you encounter one.
  • If you report a bug check to see if it's a regression by testing a previous Firefox version (if it doesn't reproduce in earlier versions it's a regression).
  • Add any reported bugs to the Bugs Found section below.
  • All results will appear in this dashboard

Beta 1

Build Info

Testing

Issues

Beta 2

Build Info

Testing

Issues

Beta 3

Build Info

Testing

Issues

Beta 4

Build Info

Testing

Issues

Beta 5

Build Info

Testing

Issues

Beta 6

Build Info

Testing

  • [DONE] Automation: review the functional, endurance, remote, add-ons tests and report bugs on any failures
  • [DONE] On-going exploratory testing around Australis
  • [DONE] Fix Verifications, focusing on those most recently fixed during this cycle.
  • [DONE] Updates: run update tests on the betatest and releasetest channel and report any failures
  • [ON TRACK] Live Updates: verify live updates work on the beta channel via automation (report)

Issues

Beta 7

Build Info

Testing

  • [ON TRACK] Automation: review the functional, endurance, remote, add-ons tests and report bugs on any failures
  • [DONE] On-going exploratory testing around Australis
  • [DONE] Fix Verifications, focusing on those most recently fixed during this cycle.
  • [ON TRACK] Updates: run update tests on the betatest and releasetest channel and report any failures
  • [ON TRACK] Live Updates: verify live updates work on the beta channel via automation (report)

Issues

Beta 8

Build Info

Testing

  • [DONE] Automation: review the functional, endurance, remote, add-ons tests and report bugs on any failures
  • [DONE] On-going exploratory testing around Australis
  • [DONE] Fix Verifications, focusing on those most recently fixed during this cycle.
  • [DONE] Updates: run update tests on the betatest and releasetest channel and report any failures
  • [ON TRACK] Live Updates: verify live updates work on the beta channel via automation (report)

Issues

Beta 9

Build Info

Testing

  • [DONE] Automation: review the functional, endurance, remote, add-ons tests and report bugs on any failures
  • [DONE] Testing around video with Silverlight and Flash to cover bug 988156.
  • [DONE] On-going testing around Australis which had, again, several small fixes.
  • [DONE] Fix Verifications, focusing on those most recently fixed during this cycle.
  • [DONE] Updates: run update tests on the betatest and releasetest channel and report any failures
  • [ON TRACK] Live Updates: verify live updates work on the beta channel via automation (report)

Issues

RC Build 1

Build Info

Testing

Issues

Firefox 29.0.1

Build Info

Testing

Issues

Bugs by Status

Resolved

Full Query
ID Summary
213517 Consider making x-user-defined an alias of windows-1252 for IE/Chrome/Safari compat
477948 "Keyhole" back/forward present on every major platform except Linux
541855 Intermittent failure in test_transitions.html | timing function test for timing function cubic-bezier(1, 0, 0, 1) : computed value 52.8px should be between 52.859280px and 53.199280px at time between 4.0002640000000005s and 4.0002640000000005s.
546169 Intermittent browser_bug415846.js | Report phishing menu should be hidden on phishing sites - Got false, expected true, | Report error menu item should be visible on phishing sites - Got true, expected false
559761 make <input type="number"> accessible
616491 Large number of groups in regex causes too-much-recursion crash (YARR)
627295 UMR [@ nsSVGGlyphFrame::PaintSVG] [@ _cairo_gstate_stroke]
627974 Arrow panel hidden behind Windows taskbar when browser not maximized
636374 Don't show multiple dialogs when a page has multiple frames with onbeforeunload
684801 Timeout failure in /testTabView_SwitchTabs/test1.js | TabView is still open.
712643 land Marionette on m-c
725252 "Bookmark All Tabs" dialog window doesn't resize properly (gtk)
726400 Intermittent REFTEST TEST-UNEXPECTED-FAIL | svg/smil/anim-path-d-01.svg | image comparison (==)
745755 Generate a marketplace bookmark on profile creation?
749804 Remove add-on bar and move content in navigation bar
758187 Write a new mozmill test for checking location sharing
759469 Add new updater instruction to add a file if it doesn't exist in the destination.
759749 crash in mozilla::dom::CanvasRenderingContext2D::DrawImage @ mozilla::gfx::SourceSurfaceD2DTarget::GetBitmap
762083 Reduce default places.sqlite size for profiles of WebApps
767939 Editing a bookmark and changing URL drops tags
778011 several dom/imptests/html/dom/ranges/test_Range-xxx mochitests disabled on android
783484 Test failure 'Shutdown expected but none detected before end of test ' in /restartTests/testAddons_uninstallExtension/test4.js
784739 Switch from NULL to nullptr
786252 "Profile already in use" message after /restartTests/testMenu_quitApplication causes profile to remain
795398 Mozmill test to check that MD5 hash signatures are no longer accepted
800872 Test failure "Window number '1' has been opened" in endurance//testTabbedBrowsing_OpenNewWindow/test1.js
804515 [B2G] Need screen orientation command in b2g marionette
812881 crash in nsMediaPluginHost::DestroyDecoder @ libsomxcore.so@0x1826, mainly on Samsung Galaxy SIII, with qcom/samsunggolden/espresso/espresso10 hw running JB
814435 Display scroll bars when async pan and zoom is turned on
820397 Audio device list on Linux is crazy-long
821475 [OSX] canvas fillText doesn't support vertical linear gradient
824021 Intermittent browser_625016.js | observe1: 2 windows in data written to disk - Got 1, expected 2 (and one more)
824433 Bookmarks backup takes a long time to write out on shutdown
827084 window.alert() and confirm() won't work in new tear-off window
832315 Intermittent browser_computedview_734259_style_editor_link.js | Test timed out
832917 Visiting an UTF-16 page adds an UTF-16 item to the Character Encoding menu that persists even upon navigating to a non-UTF-16 page
834678 crash in js::SPSInstrumentation
835357 add telemetry to measure DNT usage
835739 Move element specifications for find bar into lib/toolbars.js
839548 Excessive memory while loading PDF thumbnail view
839885 current tab should be visible by default upon opening tab drawer
840022 Test failure "The forward button has been made visible for the 1 page" in testToolbars/testBackForwardButtons.js
843203 Blending of pdf vector graphic broken in specific document
843488 pdf.js fails to render Ghostscript example shading pdf
846773 Incorrectly display shapes
847021 android.database.sqlite.SQLiteException: Can't upgrade read-only database from version <n> to 16 at android.database.sqlite.SQLiteOpenHelper.getReadableDatabase(SQLiteOpenHelper.java) at org.mozilla.gecko.db.LocalBrowserDB.filterAllSites
850372 Defect - MetroFx should treat termination-from-a-suspended-state as a normal shutdown
850721 Intermittent browser_blocklist.js | Unable to add blocklisted provider (followed by other failures)
850881 Implement explicit wait support class
851502 Create an Endurance test to measure html5 video memory use (re: bug 834667)
853301 Enable ECMAScript Internationalization API for desktop Firefox
855427 Refactor tests which use getNotification() method
856595 Intermittent test_wheel_default_action.html | doTestZoom(aSettings=deltaX is reverted), Should zoom by vertical/positive pixel event when its lineOrPageDeltaY is 1: not zoomed out, got 1
856796 crash in JSC::Yarr::Interpreter when selecting 'stop script'
857427 Intermittent browser_save_link-perwindowpb.js | Test timed out | Found a browser window after previous test timed out
860076 MOZ_ASSERT(NS_IsMainThread()) fails when opening the certificate viewer
860816 Internal PDF-Viewer displays PDF wrongly
861136 Intermittent Windows XP test_chaining.html,test_fragment_play.html,test_framebuffer.html,test_load_source.html | Test timed out.
861925 Cloning typed arrays with shared buffers and transferables does not work
863159 Rendering PDF results in huge temporary pixmaps to be created (crashing X)
863658 Intermittent layout/reftests/bugs/28811-1a.html,28811-2a.html,28811-2b.html,359903-2.html | image comparison (==), max difference: 1, number of differing pixels: 4
863872 Force sending of Telemetry if we haven't submitted anything for a week
866080 OMX Video Color Conversion fails on Nexus 4/5, SGS 3/4
866222 Always or never define getInterface on the global
867505 Intermittent test_bug536567_perwindowpb.html | application timed out after 330 seconds with no output
867597 IonMonkey: ARM hwcaps detection depends on uninitialised garbage on the stack
867600 Change hardcoded sleeps into webdriver waits
867992 Intermittent browser_webconsole_bug_630733_response_redirect_headers.js | Timed out while waiting for: 301 and 404 responses
869368 Flash elements are not correctly displayed and positioned in page on Gingerbread devices
869802 Intermittent test_bookmarks_html.js | Test timed out
870593 Add a "tip section" in Australis Customization Mode
870605 Add separator between menu button and the other widgets in toolbar
873661 Intermittent dom/browser-element/mochitest/priority/test_NestedFrames.html | Test timed out.
877376 add tests for correct handling of intermediate certificates (basic constraints)
878397 pdf.js: High "explicit" (though low "resident") due to lots of inefficient mask arrays
878436 Update Lion Fullscreen window styling offsets for OS X tabs in the titlebar
878828 finalize and enable Gamepad API
878932 Add insanity::pkix as certificate verification option.
879239 Intermittent layout/base/tests/test_bug588174.html | Second listener should fire after first listener
879616 LWT doesn't affect tab-close buttons, making them hard/impossible to see in some combinations
879668 [MediaEncoder] Implement OmxTrackEncoder on B2G
879669 Support Video Encoder module in MediaEncoder framework
879921 Use new close icons for Linux GTK theme
879981 Need feedback when an item is not removable from an area
879989 Update testNavigateFTP.js to use ftp.mozqa.com
880135 Test failure "The tab with index '1' has been selected" in testOpenInBackground.js
881413 I10t test_errorhandler.js,test_TelemetryPing.js,test_update.js,test_healthreporter.js | test failed (with xpcshell return code: -2147483645) | application crashed [@ TimerThread::Run()] (Assertion failure: rc != 0 (destroyed timer off its target thread!))
881861 Quickshare: Activity name exposed in share menu; missing package icon when applications are updated or uninstalled
882807 Invert the icons for the subview-originating button as well as add the arrow icon
883145 Window gradient misalignment in customize mode
883930 Defect - The soft keyboard should not be able to obscure input in dialogs
884226 Consider enabling authors to force usage of a software canvas to enable fast read backs
884355 "Warn me when closing multiple tabs" should warn when "Never remember history" is enabled
884402 Australis customization mode doesn't gracefully deal with toolbar overflow
885139 LWT header image applied to the selected tab isn't updated upon re-cropping
886054 intermittent test_bookmarks_json.js | Test timed out
886317 Using history widget in full-screen mode results in empty full-screen space
886573 Keyboard zoom controls change shown percentage in Australis zoom widget while in customize mode
887321 OCSP Stapling Telemetry
887397 Window click and drag target is too small
888974 Add worker tests from bug 879787
890898 https://www.flickr.com/ - mixed active content (script) is blocked
891704 [MediaEncoder] Implement MP4Writer
892630 Intermittent test_dataChannel_basicAudio.html | Test timed out, or application timed out after 330 seconds with no output on ASan
893572 Canvas2D crash [@mozilla::gfx::DrawTargetCG::StrokeRect]
893661 Back button and toolbar slightly smaller than design spec
895025 Unable to import bookmarks from IE when they contain a .lnk to a folder
895557 It's possible to set a document's URI to a different document's URI by confusing docshell
895753 Rtsp: Support suspend and resume to media stream server
896223 Remove the version 1 manifest from the mar creation scripts
896224 Remove support for the version 1 manifest from the updater
896268 Assertion failure: NS_IsMainThread() and crash [@mozilla::image::Decoder::AllocateFrame]
896620 Add marketplace certificate for desktop apps
897160 Set a minimum width for the Firefox window
897496 Fade out and cut off third-to-nth line of toolbarbutton labels in menupanel
898431 Update Mozilla to use NSS that support false start and OCSP GET (likely 3.15.4) (once it's ready)
898647 Backend for app updates
898828 crash in mozilla::layers::DeprecatedTextureHostYCbCrD3D11::UpdateImpl
898843 Defect - Update logos and colors in Metro flyout panel About
899011 Browser initialization fails with the explorer shell replacement bbLean installed
899530 The bookmarks menu from the widget closes too fast for drag&drop
899686 Intermittent test_DeferredSave.js | test failed (with xpcshell return code: 0) | "Modified data to save with delay" == "First data to save with delay"
899910 Intermittent TEST-UNEXPECTED-FAIL | layout/base/tests/chrome/test_leaf_layers_partition_browser_window.xul | Leaf layers should form a non-overlapping partition of the browser window (maximized)
900033 crash in mozilla::layers::AsyncCompositionManager::TransformScrollableLayer @ libEGL_MRVL.so
900251 Add support for add-if-not instruction added by bug 759469 to the mar generation scripts
900727 add tests for name constraints at the psm layer
900802 WM_SYSDEADKEY ignored in some contexts
901288 pdf.js Character does not display
901560 Stop adding ICE candidate lines for RTCP for DataChannels
903051 Intermittent test_bug686942.html; test case seek.webm | uncaught exception - TypeError: Value being assigned to HTMLMediaElement.currentTime is not a finite floating-point value. at test_bug686942.html:26
903274 this.updateDisplay is not a function at chrome://browser/content/search/search.xml:79 from every window during tpaint and tspaint
903885 Hostname matching code violates RFC 6125 for IDNA
904934 Not able to access navigator.mozMobileConnection if the test is running in chrome context
904953 Intermittent devtools/markupview/test/browser_inspector_markup_edit.js | This test exceeded the timeout threshold. It should be rewritten or split up.
904998 Export "close" button icon for autocomplete.
905369 Defect - History entries that use http auth cause auth prompt to appear over start UI
905621 Stylize the bad url error page
907162 Intermittent test_no_load_event.html | [SimpleTest.finish()] this test already called finish! | called finish() multiple times
907179 Tune APZC displayport heuristics
907373 -moz-os-version media query is not working on Windows 8.1
907689 Intermittent social/browser_blocklist.js | Test timed out
908134 Figure out how to offer release build to beta users
909251 DevTools Themes - Improve UI for timeline in netmonitor
909266 [wasabi] Roaming preference setting will not be saved if reboot DUT right after change the setting.
909305 Intermittent 163504-2a.html,163504-2b.html | image comparison (==), max difference: 2, number of differing pixels: 5
909349 Australis, OS X: downloads and add-on buttons don't have a depressed state
909550 Lazy load tabs panel
910375 New PanelUI / toolbar customization event spoofing
911400 MakeWrappable implementation still needs work to permit use with functions accepting objects as arguments
911547 data-URI + Firefox restart = CSP bypass
911904 Galaxy S4 - HelperApps PageAction shows on pages that end in .html or .htm
911981 Chat panels are lost while detaching/attaching
912627 Intermittent media/test/crashtests/459439-1.html on linux{32,64} | assertion count 1 is more than expected (Don't call during shutdown!: '!mShuttingDown')
913138 Intermittent test_service_login.js | test failed (with xpcshell return code: 1) | application crashed [@ nsContentUtils::IsCallerChrome()]
913160 Deleting history caused browser hang due to the changes in bug 894331
913609 Intermittent browser_context_ui.js | runTests: Task failed - Error: pageshow event timeout at waitForEvent@chrome://mochitests/content/metro/browser/metro/base/tests/mochitest/head.js:329 | navbar dismissed
914644 HTTP cache v2: failure of test_doomentry.js | 2147746065 == 0 | test_doomentry.js :: check_doom3 :: line 74
914847 IPDL::PBrowser::RecvRealTouchEvent causes 50ms sync reflow
915312 Ship minimal PBKDF2-SHA256 native library for Android
915449 Intermittent (testNewTab | testShareLink | testSearchSuggestions | testBookmark | testMasterPassword | testBookmarksPage | testBookmarksPanel) | Exception caught - junit.framework.AssertionFailedError: EditText is not found!
915499 Defect - Download progress quickly flashes as "completed" and then starts the download progress
915835 fix event listener leak in socialmark xbl handler
915931 Add OCSP support to insanity::pkix
915974 USB connections gets disconnected when phone screen times out
915985 Add a ZoomConstraints class to hold the allowzoom and min/max zoom values
917797 Intermittent test_master_password.html | checking expected user to have been filled in - got , expected user1 (and more)
917896 Replace progress throbber with a progress bar
917942 Create a JS API for Sync accounts
918880 MaybeAllowOfflineAppByDefault must work on child processes
919072 Intermittent TEST-UNEXPECTED-FAIL | browser_webconsole_bug_601352_scroll.js | scroll location is not at the top - Didn't expect 0, but got it
919076 Support group and world-readable saved file permissions on Linux and Mac
919208 Intermittent test_bug668513.html | /tests/docshell/test/test_bug384014.html finished in a non-clean fashion, probably because it didn't call SimpleTest.finish()
919244 ghost-windows appears on https://apprtc.appspot.com/ after execute "Minimize memory usage"
919482 Intermittent layout/reftests/bugs/163504-1a.html | image comparison (==), max difference: 2, number of differing pixels: 5 | 163504-1b.html | image comparison (==), max difference: 2,
919592 ARM asm.js crash with c64 emulator crash [@ js::jit::Assembler::bind(js::jit::Label*, js::jit::BufferOffset) ]
919777 HomeListView is slow on startup
920236 Add a pref to display a page on first run after install/upgrade
920791 Hide home banner when in editing mode
920952 Flush metro test harness output to avoid timeouts due to no output
921390 [DSDS][Gaia] Need to show carries' names in lock screen for DSDS.
921470 Assertion failure: [barrier verifier] Unmarked edge: baseline-monitor-typeobject, at gc/Verifier.cpp:569
921571 IonMonkey: SetElementIC dense element stub ignores double arrays
921670 text in Flash content is mojibake
921804 Prompt checkboxes shown in the wrong place
921885 Use insanity::pkix for EV (extended validation) certificate verification
921886 Add certificate policy support to insanity::pkix
921887 Add minimal DER decoder to insanity::pkix
921888 insanity::pkix nullptr workaround for GCC breaks clang build
921889 add minimal std::bind/ref/cref polyfill to insanity::pkix
921890 Add NSS-based key extraction and signature verification to insanity::pkix
921891 Add path building and verification of non-extension certificate fields to insanity::pkix
921892 Verify certificate basic constraints extension in insanity::pkix
921893 Verify certificate key usage extension in insanity::pkix
921895 Verify certificate extended key usage extension in insanity::pkix
921896 Check name constraints extension in insanity::pkix
922465 Automated tests for the Nuwa process
922601 Signed integer overflow in content/media/MediaStreamGraph.cpp
922926 [NetworkStats API] Allow to track system-only network traffic
922967 Test failure "Identity is unknown - 'verifiedIdentity' should equal 'unknownIdentity'" in /testSecurity/testSecurityNotification.js
923304 test ocsp stapling with an intermediate certificate that itself has an ocsp aia
923345 Intermittent TEST-UNEXPECTED-FAIL | test/browser_thumbnails_background_crash.js | This test exceeded the timeout threshold. It should be rewritten or split up.
923424 Test failure 'Recently Closed Tabs' sub menu has one entry - '0' should equal '1' in " /testSessionStore/testUndoTabFromContextMenu.js "
923468 Intermittent test_dataChannel_basicVideo.html | application crashed [@ msvcr100.dll + 0x1e2ad]
923614 Intermittent conformancetest/test_runtest.html | application crashed [@ js::jit::IonBuilder::inlineScriptedCall(js::jit::CallInfo&, JSFunction*)] | Assertion failure: !analysisContext->isExceptionPending(), at ../../../js/src/jit/IonBuilder.cpp:3874
924348 Intermittent PROCESS-CRASH | /tests/dom/indexedDB/test/test_add_put.html | application crashed [@ sqlite3LeaveMutexAndCloseZombie] or [@ hashDestroy]
924366 Animated GIFs loop before they have finished decoding
924740 [fugu]It throws exception when run ICCIOHelper.processICCIOGetResponse for USIM card
924886 Update Metro session store component to share same session store state as Desktop's session store
924905 Missing stack frames coming from the content scope in a chrome event listener attached to a content node
924972 Intermittent B2G test_reftests_with_caret.html | application timed out after 330 seconds with no output
925747 Files extracted from Mar file are not locked during update
927128 Keep GeckoView limited to Nightly only
927285 Intermittent TEST-UNEXPECTED-FAIL | test_submit.py test_submit.TestSubmit.test_should_submit_a_form_when_any_input_element_within_that_form_is_submitted | AssertionError: u'We Leave From Here' != 'We Arrive Here'
927402 Disabling telemetry through settings still shows "enabled" under about:telemetry
928619 When find bar closes, current match selection is lost
928722 Resample the system scrollbar width when the UI theme is changed or mouse plugged in
928734 Intermittent test_419731.js | "title 2" == "new title 1" - See following stack:
928968 Add a command to the gaia command line tool to print the applications installed
930056 [B2G][Lockscreen] Receiving a call while on the lockscreen results in the answer/ignore slider not appearing until the screen is tapped.
930064 Menu Panel has different style than other panels
930094 Browser windows sometimes have the nav-bar drawn in the titlebar
930108 [B2G][Settings][Your Privacy]Icons on Your Privacy page overlap their Title text.
930282 Enable the Nuwa process on B2G by default
930735 crash in js::CloneFunctionObject(JSContext*, JS::Handle<JSFunction*>, JS::Handle<JSObject*>, js::gc::AllocKind, js::NewObjectKind)
930857 NewSessionTicket handshake message in a resumption handshake replaces cached session's ticket before handshake is finished
930874 TOCTOU, potential use-after-free in libssl's session ticket processing due to lack of lock protecting the sessionTicket field of the sid
931013 Intermittent TEST-UNEXPECTED-FAIL |tests/content/smil/crashtests/690994-1.svg | load failed: timed out waiting for reftest-wait to be removed
931028 Panning about:start is very janky in 10/24 nightly
931108 Dotted outline of navbar in customize mode is in the wrong place after bug 895836
931343 Australis - Implement bookmarking animation
931348 B2G MMS: Cannot send MMS after resetting Message settings (even without any changes)
931740 [B2G][FOTA]The handset has no response if sdcard is full before applied the update
931891 Backout the patch for bug 887515 and its dependencies from Firefox
932092 Add JS module for adding UI telemetry probes
932235 new email link icon
932759 Sync hangs in form history sync if browser.formfill.enable is false, but history sync is enabled
932820 crash in mozilla::MediaPluginReader::DecodeVideoFrame(bool&, long long) HTC One/Adreno 320
933093 [Gecko] Add Handover DOM API to NFC
933109 "Unknown" OCSP responses are being cached in memory, preventing us from receiving a "Good" response
933264 In some cases with the displayport set, the clip on a scrollframe isn't correct
933422 Hiding keyboard when showing search suggestions briefly shows background
933483 [Poppit] App freezes when changing Poppit skill level
933733 Page doesn't load/render if the mouse is not moving
934075 Add a background to empty menu panels.
934322 Intermittent talos KeyError: 'CMD'
934412 Nightly Fennec cannot show the content of mp4.
934470 Cursor pin disappears on drag in textarea input
934509 crash in nsGlobalWindow::RunTimeout(nsTimeout*)
934545 Do not allow p-1 as a public DH value
934760 implement synthetic APK update flow
934794 Intermittent test_streams_tracks.html | Test timed out.
934843 Intermittent test_CSP_frameancestors.html,test_CSP_evalscript_getCRMFRequest.html | Assertion count 1 is greater than expected range 0-0 assertions. "Unexpected focus on a popup window"
935254 Regression: atk_text_get_text_at_offset implementation broken for list items starting 03 July 2013
935264 [robocop] Add more test cases to testHomeBanner
935375 Word offsets broken if the next word is an embedded object
935377 Firefox should fix common scheme typos
935451 Test failure "Geolocation position is: Position acquisition timed out" in /testGeolocation/testShareLocation.js
935501 Get mouse events working for <input type=number>'s spin up/down buttons
935506 Make <input type=number> respond to the up/down arrow keys
935542 crash in java.lang.NullPointerException: at org.mozilla.gecko.home.TopSitesPage$EditPinnedSiteListener.onSiteSelected(TopSitesPage.java)
935676 Flash doesn't work on 4.4 KitKat
935692 Crash in [@ ReportErrorRunnable::ReportError ]
935773 Social Bookmark button icon doesn't show on Windows
935807 D-pad arrow keys move focus outside textarea instead of navigating within
935823 UITour: Add close button to info panel
935834 CID 1123240: Resource leak on OOM in CodeGenerator.cpp as found by Coverity
935876 <select> element shouldn't consume key events which don't cause any default action
936008 crash in java.lang.NullPointerException: at org.mozilla.gecko.gfx.LayerView.setZoomConstraints(LayerView.java)
936056 Inconsistent this value when invoking getters on window
936195 UITour: Give webpage a way to query what UI targets are available
936198 Updated Yahoo Logo on desktop search drop-down
936236 Notify memory-pressure observers when allocating a large ArrayBuffer fails
936402 Race condition in UnixSocket; resulting in segmentation fault
936409 Intermittent TEST-UNEXPECTED-FAIL | chrome://mochitests/content/browser/dom/indexedDB/test/browser_perwindow_privateBrowsing.js | Test timed out
936442 Australis: Character encoding widget shows encodings that are not in the Encoding Standard
936453 Assertion failure: addr % CellSize == 0, at c:\work\mozilla\builds\nightly\mozilla\js\src\gc/Heap.h:1062
936500 Requesting a displayport outside the currently visible region fails to build a layer for the content
936635 Defect - Tapping the 'X' of a tab in the tab strip does not close the tab if the side-scroll-arrows are visible in the tab strip
936784 Firefox crashes while left unattended, memory climbs, due to webaudio leak
936790 (gcc 4.5) Build error: "We don't want these libstdc++ symbols to be used" when building with --enable-stdcxx-compat and WebRTC
936808 Intermittent test_sanitySimpletest.html | application terminated with exit code 11 | application crashed [@ PK11_ImportCert]
937089 Assertion failure: !val.isMagic(), at jsobj.cpp:5358
937132 LifoAlloc missing overflow checks
937198 Clipping/displayport issues when scrolling a subframe with a keyboard
937697 Dangerous crash on Heap, possibly near [@ js::jit::CharCodeAt]
937734 Adjust height of navbar to 40px per Australis specs on OS X
937793 Assertion failure: getElementsHeader()->capacity >= getElementsHeader()->initializedLength, at jsobj.h:611 or Crash [@ fetchNextFreeArena]
937915 Restore DB filenames in Telemetry SlowSQL strings
937917 [Facebook] Fix to support https and enable webshare activities
938092 Building with gcc4.5 fails if both --enable-webrtc and --enable-tests
938107 Hang at shutdown since Firefox25
938153 Selectively display the globe favicon placeholder when favicon fetches take long enough to be noticeable
938324 Defect - NavBar and OSK have different transition timing/aren't in sync
938406 [B2G][Contacts] Unable to access contacts imported from Facebook after rebooting device
938470 Investigate increasing usable memory on FxOS by delaying homescreen launch
938555 SVG Elements not being rendered after manipulating transform
938578 Update separators style in the Developer and History subviews
938640 It's possible to call some methods on a cross-origin window
939056 B2G NFC: enable/disable MOZ_NFC at runtime
939084 Intermittent browser_social_chatwindow_resize.js | 10: correct number of chats visible - Got 2, expected 1
939088 massive regression in testClosureAssign
939117 WebGL2: Assertion failure: targetSlot (unknown query object's type) [@mozilla::WebGLQuery::IsActive]
939302 Bug 927711 introduced a GC hazard in MMS code (should use long-long to specify timestamps)
939719 stop packaging tests.jar up during a build
939962 Gallery app will get OOM process killed upon saving an edited photo after flashing or resetting the device
940038 Australis: Subviews don't show shortcuts (in the menu panel)
940133 Australis: Invert icons in the tabstrip and menubar on Windows Classic
940265 Bookmarks popup menu changes position on mouse over
940379 Bookmarks panel isn't aligned with other panels (such as the downloads panel, the main menu panel, etc.)
940393 Win8: Text color on inactive tabs makes text very hard to read
940509 The private browsing indicator on Windows seems out of place
940677 Change - Add a pref to disable auto switching between Desktop/Metro for Laptop/Slates
940684 Device Storage - Additional security issue with OOP on FirefoxOS
940740 B2G crash in nsXPCWrappedJS::AddRef()
940811 Browsermark "Graphics HTML5 Canvas" test is 8x slower than Chrome
940844 Australis: sync busy icon (sync pending) in menu is low quality/missing
940889 window.innerWidth is not up-to-date in window.onresize listener
940907 Re-introduce the Character Encoding menu to the View Source window
940965 Intermittent TEST-UNEXPECTED-FAIL | js/src/jit-test/tests/parallel/ic-setelement.js | --ion-eager --ion-check-range-analysis --no-sse3 | Assertion failure: 0 == rv, at nsprpub/pr/src/pthreads/ptthread.c:847
940973 New Firefox ESR versioning causes the language pack be disabled with every new update
940997 The new quick share row in the menu looks visually unbalanced
941102 closeWindow not matching webdriver command close
941129 getAllCookies not matching webdriver command getCookies
941132 getElementPosition not matching webdriver command getElementLocation
941136 getUrl not matching webdriver command getCurrentUrl
941140 getWindow not matching Selenium command getCurrentWindowHandle
941144 getWindows not matching Selenium command getCurrentWindowHandles
941145 goUrl not matching webdriver command get
941148 screenShot not matching webdriver command takeScreenshot
941196 Australis menu can jump around when opening long submenu
941284 Make 'top sites' screen less white / bare with fresh profile
941309 [Australis] Switching tab groups will not update the tab overflow correctly, and leaving only pinned tabs can create weird overlap between tabs and the navbar
941430 Max tab width is smaller in Australis
941457 Defect - Overlay buttons disappear when clearing History & Other Data
941511 [wasabi] During voice, 1x icon is on notification bar.
941585 Converting SVG textPath to Moz2D has broken some SVGs
941587 Intermittent TEST-UNEXPECTED-FAIL | chrome://mochitests/content/browser/toolkit/components/satchel/test/browser/browser_privbrowsing_perwindowpb.js | Test timed out
941701 [WebVTT] Crash in [@ mozilla::dom::TextTrackCue::GetCueAsHTML()]
941744 Remove send tab feature from release builds so Firefox Sync doesn't show up as a share option
941774 Add support for touch input injection for testing purposes
941862 UITour: Fire an event to notify when the menu panel opens while the menu button is an info panel target
941873 MediaStreamGraph keeps consuming CPU for AudioContexts in BFCache
941887 feDisplacementMap should check taintedness of the image with the displacements
942024 Yahoo search not using custom search codes
942077 Test failure "Element.waitForElement(): Element 'Selector: *[label='Test Bookmark 1']' has been found" in /testBookmarks_OpenAndClose/test1.js
942164 imgRequestProxy Use-After-Free Remote Code Execution Vulnerability (ZDI-CAN-2036)
942189 Pages with slow loading sub frames (or other resources) can't pan or zoom by touch
942229 Intermittent browser_cmd_screenshot.js | status (for 'screenshot --selector img#testImage') - Got ERROR, expected VALID | markup (for 'screenshot --selector img#testImage') - Got VVVVVVVVVVVIIIIIIIIIIVIIIIIIIIIIIII, expected VVVVVVVVVVVVVVVVVVVVVVVVVVVVVV
942246 Event fluffing fails to generate a click under certain conditions
942530 Assertion failure: obj->compartment() == obj2->compartment(), at c:\work\mozilla\builds\nightly\mozilla\js\src\gc/Marking.cpp:1448
942565 IonMonkey (ARMv6): clampDoubleToUint8 returning 255 rather than 0 for an input of NaN
942600 Australis: dropping new bookmarks on the Bookmarks Toolbar Items when in the navbar triggers overflow
942620 do you want to cancel download dialog appears twice on ctrl-w on last open tab
942711 Test failure 'Add-ons Manager has been closed.' across several tests
942730 The send_keys() method of input element (type is number) will raise MarionetteException
942791 Non-ASCII file names should be accessible in FTP directory listings regardless of the FEAT/UTF8 support
942929 Long pressing an element without any contextmenu does not trigger a click
942950 Use after free/double free bug when pruning a newly initialized TURN candidate.
943021 Safebrowsing service should use fallible arrays for its buffers
943071 Selection monocles aren't positioned correctly after the browser shifts due to skb display
943191 [fugu] [B2G] [DSDS] On 1st sim slot, it's hard to establish data call connection unless we manually select preferred network type as WCDMA only
943201 Match the Progress Download Gradient with the Page Load Gradient
943210 [DSDS] RSSI is not correct when there is only one SIM inserted.
943215 [DSDS] We shouldn't radio on on slot 2 when a card is absent otherwise single SIM cases are not correctly supported
943227 [DSDS] When device is out of coverage, only SIM 2 icon on status bar is correct.
943275 Intermittent TEST-UNEXPECTED-FAIL | test_conference.js | ScriptTimeoutException: timed out
943366 crash in js::ExclusiveContext::getNewType(js::Class const*, js::TaggedProto, JSFunction*)
943383 'Allow now' becomes 'allow and remember' if looking again in the CTP doorhanger
943460 [B2G][MMS] Attachment does not appear in the message until hitting Send button
943521 Update desktop FXAccountsClient to use 'onepw' protocol
943618 complete audio silence with (at least some plantronics) headsets
943759 UITour: Pointer-events should go through highlights
943765 UITour: Make highlights circle when the target is close to being square
943793 Intermittent TEST-UNEXPECTED-FAIL | chrome://mochitests/content/browser/browser/components/privatebrowsing/test/browser/browser_privatebrowsing_localStorage.js | localStorage should contain 2 items - Got 1, expected 2
943803 Image decoding causing FireFox to crash with Goo Create
943849 [Shared] Fixed headers does not follow correctly the rendered view
943852 Crash on Heap with SIGTRAP and TypedObject
943925 crash in @0x0 | mozilla::WebGLContext::ForceClearFramebufferWithDefaultValues(unsigned int, bool const*)
944079 [Australis] Remove one of the two hover states of items in the bookmarks panel
944087 Black screen after unlocking Windows XP
944094 segfault in {nsJPEGDecoder,nsPNGDecoder}::InitInternal
944215 OSK not appearing on the first tap under Navigation App Bar (also not dismissing)
944225 B2G DSDS: support setting preferred network type for each sim
944230 [DSDS] When inserted VIBO operator SIM in slot 0, another different SIM in slot 1, operator name of both SIM in SIM manager are all VIBO.
944255 Defect - about:start bookmarks and history tiles cut off when using split views
944262 [B2G]On conference call,we can't switch the speaker between off and on
944291 Cropping of element with css transform + animation applied, starting in Firefox 25
944321 --ion-check-range-analysis failure with Float32Array (SIGTRAP)
944337 Test failure "Modal dialog has been found and processed" in /testAddons/testInstallAddonWithEULA.js
944353 ABORT: Not allowed to make more decoder calls after error!: '!HasDecoderError()'
944362 Scrolling a <select> element causes mouse events on that element to have wrong y coordinates
944374 Security vulnerability: CrashReporter Path Traversal
944397 [Input method API] inputContext is not accessible if the app frame is loaded *after* user had focusing the input field
944407 XBL scriptability should not depend on the scriptability of the bound content
944542 DLL block request: spvc32.dll (Conduit)
944567 [Flatfish ]: Camera recording should support AAC encoding based on Android JB (4.2.2)
944579 heap-buffer-overflow in mozilla::gfx::FilterProcessing::ApplyMorphologyHorizontal_SSE2
944601 [Settings] Enter wrong PIN code twice and then enter the correct code. There's still "Last try" left on the screen
944665 Call preload slow things after preallocated process is forked from Nuwa
944717 Test failure "Successfully restarted in 32bit mode after requesting it - 'x86_64-gcc3' should equal 'x86-gcc3'" in /restartTests/testRestartChangeArchitecture/test3.js
944737 [windows] Rendering glitches on color picker dialog when opened simultaneously in 2 Firefox windows
944805 battlelog web plugin not working in latest nightlys
944851 Array out-of-bounds [@ mozilla::dom::AudioParamTimeline::AudioNodeInputValue]
944886 Animated element vanishes
945066 e10s: need name resolution service
945088 Reftest layout/reftests/bugs/942672-1.html fails on Windows non-D2D
945105 style changes not handled properly with ::first-line and continuations
945147 [DSDS] Sometimes WiFi will be disabled after turning off airplane mode.
945189 Intermittent TEST-UNEXPECTED-FAIL | /tests/content/base/test/test_bug602838.html | Async script should have run first.
945210 libssl cannot negotiate a TLS 1.2 connection to billingcp.us whereas some other implementations can
945223 Assertion failure: index >= size_t(parser.stackDepthAtPC(current)), at ../jsopcode.cpp:1796
945241 Crash [@ visitReferences<js::MemoryTracingVisitor>] with TypedObject
945251 Reader mode toolbar tap highlight colour is orange instead of grey
945327 crash in libc.so@0x22048 / libc.so@0x21f90 - Android 4.4 Nexus devices - Downloading files
945429 Do not handle file: paths by downloading them
945438 Can't select menu items with mouse in Google's div-based select widgets
945449 FxAccountsClient should support auth server's backoff protocol
945475 Intermittent test_reset_src.html | videoHeight should be zero when there is no video. - got 300, expected 0 | videoWidth should be zero when there is no video. - got 400, expected 0
945489 Intermittent browser_webconsole_bug_642615_autocomplete.js | Timed out while waiting for: completion value for 'docu'
945521 Regression: go button disappears from toolbar when typing on HTC or SwiftKey keyboard
945562 [Camera] Camcorder fails to create video files with permission error
945585 Crash involving nsNodeUtils::LastRelease(), possibly due to running it twice
945618 Buffer overflow in OPUS tansig_approx
945634 Async zooming of fixed position, aligned content has regressed
945645 HTML5 audio with mp4 file instantly crashes browser
945647 [DSDS][MMS] When change primary outgoing data SIM during MMS attachment downloading, it should stop downloading process.
945655 Major regression in scrolling http://w3c.github.io/webcomponents/spec/shadow/#distribution-results
945697 Responsive Mode gets closed when ESC is used in the varilable view, in the rule view and in the variable view
945707 Pausing a download fails when done after a retry
945711 [Messages] We lose the 'body' information when migrating
945765 Add some basic apzc tests to catch regressions
945779 seer thread may be taking upwards of 15% CPU during pageload
945784 Fire 'input' and 'change' events for <input type=number> more frequently, per the new HTML5 rules
945829 Metrofox hangs on startup when trying to show the profile chooser dialog
945842 "Firefox Touch" Folder should only be for Win8
945864 [B2G][Music] On occasion the duration of songs displays a large number
945912 Crash [@ MOZ_PNG_do_expand_plte] with broken png file
945948 [B2G][SMS] The user cannot scroll through their entire contact list when composing a SMS
945973 A system-wide memory reporter for B2G
945979 Intermittent browser_privatebrowsing_geoprompt.js | Test timed out | uncaught exception - ReferenceError: executeSoon is not defined at chrome://mochitests/content/browser/browser/components/privatebrowsing/test/browser/browser_privatebrowsing_geoprompt.j
946047 [B2G][Settings][NFC] Fix HasNfcSupport in MozNfc.webidl
946066 Intermittent browser_webconsole_bug_658368_time_methods.js | Timed out while waiting for: bTimer (or aTimer) started
946067 Can no longer focus() a cross-origin window
946083 Incremental builds with pushed and popped patches that include inner classes cause ProGuard errors
946164 touch events disappear
946184 Sometimes style resolution goes wrong for the anonymous content of <input type=number>
946240 [Bluetooth][gonk-kk] [bluedroid]Porting bluetooth module
946243 Crash with SIGTRAP and prototype
946296 Defect - Desktop add-ons loading into Metro browser
946316 Allow the use of strings as DataStore IDs
946335 about:start no longer displays scrollbars
946339 Tap and hold does not highlight the targeted element
946340 Split view about:start pages don't touch scroll
946390 Allow content to preventDefault key events targeting <input type=number>
946408 Input fields are not scrollable with APZC enabled
946475 [OMTC] rendering Issues on Twitter timeline background
946502 background-attachment: fixed images jitter and jump during async touch panning/scrolling
946540 Foxkeh can no longer loop-the-loop (animateMotion stops part way)
946588 UI still indicated airplane mode is on while it's off after dialing out emergency call.
946595 Win 8 high contrast themes are also considered to match -moz-windows-default-theme
946596 Hi-res phone does not take hi-res screenshots
946656 TEST-UNEXPECTED-FAIL | testSessionHistory | testAboutHomeVisibility | testInputConnection | The Toolbar title is (title) - got (url), expected (title)
946658 Intermittent browser_dbg_variables-view-popup-07.js | [@ nsView::DoResetWidgetBounds(bool, bool)] or [@ nsViewManager::ProcessPendingUpdatesForView(nsView*, bool)]
946661 Taps > 300ms are ignored if APZC content disables zooming
946667 Intermittent TEST-UNEXPECTED-FAIL | test_calendar_today_date.py test_calendar_today_date.TestCalendar.test_check_today_date | AssertionError: 'Wed Dec 04 2013' not found in u'Thu Dec 05 2013 00:00:00 GMT-0800 (PST)'
946679 Differential Testing: Ion incorrectly gets NaN with max of fround
946813 Stepping over a breakpoint just continues execution in Browser Debugger
946873 Clicking on the borders of bookmarks widget in the panel makes a panel appear
946877 __declspec(noreturn) may be adversely affecting stackwalking of NS_ABORT_OOM (Windows)
946929 Intermittent browser_dbg_variables-view-popup-05.js,browser_dbg_variables-view-popup-06.js | application crashed [@ nsPresContext::IsDOMPaintEventPending()]
946942 [MMS] MO/MT MMS fail if the MMS APN is shared with default APN
946952 Camera preview cannot be render with HwcComposer2D
946987 [Australis] curved tabs looks ugly when scaled up (hi-dpi)
946999 [Homescreen] With APZ turned on the homescreen is not rendered until you touch the screen in certain conditions
947070 Assertion failure: containsPC(pc), at jsscript.h
947073 Phishing Warning hides "Why is this page blocked" under "ignore warning"
947078 Make the "Include URLs" option for the crash reporter into a checkbox instead of a toggle
947100 B2G NFC: enable/disable NFC worker at runtime
947101 Rtsp: Backward seek fail.
947110 B2G RIL: Add support for decoding FCP Template in BerTlvHelper.
947113 Rtsp: Can't post seek command due to decoder thread is blocked.
947132 [RTSP] Replace system message by activity when handing off rtsp URL loading
947146 Taps send a mouse move at the last position of the mouse
947158 Use-after-poison in nsLineLayout::RelativePositionFrames
947213 crash in mozilla::layers::DeprecatedTextureHostBasic::UpdateImpl with e10s tabs on desktop
947261 Regression: Gap above the first row of icons in the menu
947275 Update Bing favicon to match current branding
947281 Search via web magnifying glass alternates visibility in action-bar on text-selection
947321 Inconsistencies in action-bar overflow menu for selected text
947337 Touch Events coordinates returns strange values
947346 UI regression for toolbox toolbars and tabs on Windows since bug 941673
947431 Crash in mozilla::MediaStreamGraphImpl::RunThread() while receiving calls and sms
947488 Bookmarks list too short and no scrollbar
947504 [v1.3] Screen colors are off and display blinks
947507 Current character Encoding auto-detect method is gone when upgrade to Nightly/Holly 28 from Aurora27
947525 Intermittent test_scriptSettings.xul | Test timed out.
947527 Correct waitForPageIndex output for device
947550 Intermittent testAboutHomePageNavigation | Waiting for HomePager {BOOKMARKS,TOP_SITES} page. -
947570 Intermittent browser_597071.js | application timed out after 330 seconds with no output
947572 client destroys session ticket in cache when it receives a NewSessionTicket message with an empty ticket
947583 "this.updateProviderURLs is not a function" when toggling "Block reported attack sites" preference
947585 [B2G][FOTA] Update will not stop when available space is not enough
947587 non-jit build failing with invalid use of incomplete type 'class js::jit::TempAllocator' - related to unified builds ?
947588 Invalid characters displayed as hexboxes
947592 Cross-origin information disclosure with error message of Web Workers
947683 Unable to compile non-threadsafe js shells using --disable-threadsafe
947710 Trying to add a property in the manifest editor can break the editor
947718 Work around bug 946184 for Aurora
947745 Cap maximum size of seer.sqlite
947772 Sync adds tracker observers regardless of engine enabled state
947778 TEST-UNEXPECTED-FAIL | addon-sdk/tests/test-ui-sidebar-private-browsing.testDestroyEdgeCaseBugWithPrivateWindow | Test output exceeded timeout (300s).
947793 Text selection action-bar appears on focus of editable elements with no clipboard content; clipboard button does nothing
947805 Multiple hwc prepare calls lead to deadlock in HAL.
947814 [WAP Push] Provide data.length instead of dataLength in authInfo and raw wap push data
947836 Non-toolbox devtools toolbars are grey
947856 Regression: Bug 855208 Removed the Check of Muting Background Content Channel by Video with Normal and in Foreground
947860 Expose data SIM information instead of first SIM in the WebPaymentProvider API
947862 DataChannels demo crashes due to no clock available
947879 Intermittent TEST-UNEXPECTED-FAIL | /builds/slave/m-in-l64-asan-d-00000000000000/build/python/mozbuild/mozpack/test/test_manifests.py | line 122, test_pattern_expansion: Lists differ: [u'dest/foo/file2', u'dest/foo... != [u'dest/foo/file1', u'dest/foo...
947928 [RTSP] System crash when opening RTSP for the second time (NAT problem)
947931 Possible deadlock in APZC
947939 SQLiteDatabaseLockedException from BrowserDB.expireHistory
948002 WebGL framebuffer completeness check fails with depth texture (regression)
948003 crash in _JNIEnv::CallStaticObjectMethod(_jclass*, _jmethodID*, ...) | anp_system_loadJavaClass(_NPP*, char const*)
948005 crash in android::OmxDecoder::NotifyDataArrived(char const*, unsigned int, long long)
948023 Refactor ReconstructStackDepth to allow handling of OOM condition
948092 Random failure in test_largemenu.xul
948139 Add telemetry for switching from Metro to Desktop
948157 Unify styles of action bars shown for browser toolbar/web content
948188 Handle OOM in NewPropertyIteratorObject
948233 Improper OOM check in DoCompareFallback
948301 Unable to compile js shells on Windows
948307 [DSDS] SIM manager is loaded about half second later than other items in Settings when first launch the list.
948324 DevTools Themes: Remote connection screen does not have devtools text input styling
948326 Division by 0 in mozilla::MP3FrameParser::GetDuration with gstreamer
948387 Intermittent TEST-UNEXPECTED-FAIL | testAddSearchEngine | Exception caught - java.lang.NullPointerException
948389 Intermittent REFTEST TEST-UNEXPECTED-FAIL | tests/layout/reftests/bugs/405577-1.html | image comparison (==), max difference: 16, number of differing pixels: 73
948399 [Messages] Subject. A subject containing special characters sent in a message is not received correctly
948406 Intermittent TEST-UNEXPECTED-FAIL | tests/content/canvas/test/reftest/webgl-orientation-test.html?readback&__&_____&preserve | application timed out after 330 seconds with no output | application crashed [@ eglCreatePbufferSurface]
948423 Assertion failure: mutationCount == p.mutationCount, at dist/include/js/HashTable.h:1459
948433 PDF.js needs updating to take account of the new <input type=number> support in Firefox 28
948475 Implement HTMLInputElement.select() for <input type=number>, contrary to the HTML5 spec
948478 Metro Firefox hangs at startup trying to show add-on update dialog
948485 FX OS crash in mozilla::dom::PContentParent::SendNuwaFork()
948545 New Permaorange: /tests/dom/ipc/tests/test_NuwaProcessCreation.html | Nuwa process is not launched
948549 Make <input type=number> behave honor the 'disabled' attribute, and correctly disable when inside a disabled fieldset
948555 Assertion failure: compositor (Passed invalid backend hint), at ../../../../mozilla/gfx/layers/ipc/CompositorParent.cpp:731
948596 [B2G][Gallery][Wallpaper] Wallpaper preview-page through the Gallery app has a gap on the top of the screen
948654 flex items not wrapping in multi-line flexbox with "overflow:hidden"
948725 Intermittent cppunittests TEST-UNEXPECTED-FAIL | Response written
948743 nsINetworkService::GetNetworkInterfaceStats broken by change to netd
948769 [Settings][DSDS] Default service ID should be a number
948774 B2G get_about_memory.py script doesn't work
948778 Add vertical rule to tab strip to visually indicate a cut-off point
948782 make test_alerts_noobserve.html wait until its alerts have disappeared before finishing
948829 Temporarily disable Nuwa until about:memory fixed.
948833 xpcom/base/nsMemoryReporterManager.cpp:225:23: error: no member named 'max' in namespace 'std'
948839 Drag and Drop broken
948847 [Gaia] add AirplaneModeHelper to make sure settings app and system app will not do the same thing
948848 Rendering of svg content embedded inline in outer svg is erroneously clipped depending on zoom scale
948850 B2G NFC: to add onpeerready causes app to be killed
948929 Assertion failure: fun.executionMode == gen->info().executionMode(), at ../jit/shared/CodeGenerator-shared.cpp:642
948946 Themes should be consistent between different GTK platforms
948978 Australis: Character encoding widget does not show properly
948983 Desktop and Metro start pages should be compatible when switch between the two
948994 [e.me] Temporarily disable stats reporting
949132 Replace UpdateScrollOffset with a flag on the FrameMetrics during layer updates
949173 Intermittent browser_ruleview_734259_style_editor_link.js | Test timed out
949191 [B2G][Browser] unknown cert issuer error message text overlaps the border and the text's letters are too small to read it
949197 [B2G][Contacts] Facebook contacts imported, display "Undefined" when editing.
949214 [B2G][Contacts][Facebook] User is unable to sync Facebook contacts
949227 TEST-UNEXPECTED-FAIL | chrome://mochitests/content/browser/browser/base/content/test/general/browser_bug609700.js | Found an unexpected tab at the end of test run: about:blank
949264 Allow using union members in codegenerated events
949271 Support unions inside sequences/variadics in JS-implemented codegen
949275 Webpages tear while scrolling
949297 Errors when unloading registered widgets that reside in toolbars
949310 Undefined value error in nsDisplayOwnLayer::BuildLayer()
949324 Fix -Wunused-function warnings in js/
949333 Defect - Metro Firefox fails to submit login forms if profile has a Master Password
949345 Get telemetry for non-default Cyrillic encodings
949346 Intermittent TEST-UNEXPECTED-FAIL | /tests/content/media/test/test_streams_element_capture.html | small-shot.mp3 current time at end: 0.026122093200683594 should be: 0.27
949347 Intermittent PROCESS-CRASH | /tests/dom/camera/test/test_camera.html | application crashed [@ mozilla::layers::TextureClient::Finalize()] or timed out after 330 seconds and crashed
949353 dom/workers/WorkerPrivate.cpp: [-Wsometimes-uninitialized] variable 'preventDefaultCalled' is used uninitialized whenever 'if' condition is false
949360 Check for Image AllocateBuffer() failures
949401 Marionette python client is missing resources from latest marionette_client 0.7.0
949404 [keyboard] With APZ turned on and multiple APZCs the app is not correctly repainted when the keyboard is dismissed
949428 Test failure "Search bar has the focus - '[object HTMLInputElement]' should equal '[object XULElement]'" in testSearchViaShortcut.js
949429 Intermittent PROCESS-CRASH | java-exception | java.lang.IndexOutOfBoundsException: Invalid index 0, size is 0 at java.util.ArrayList.throwIndexOutOfBoundsException(ArrayList.java:257)
949458 (Nexus 7 2012) - the tabs button is wrongly displayed after open a link in new tab
949471 Firefox v26 history.data returns undefined when it should return null
949475 Add extra debug checks for MIR return values
949548 crash in @0x0 | mozilla::layers::Axis::DisplacementWillOverscroll(float)
949590 When switching browsers, wait for the previous instance to close the profile before launching
949612 Restore closed tabs and make the JSON sessionstore format for them compatible with desktop
949613 Scrolled off title-bar is shown when prior it is hidden after an action or dismissal of use of the text-selection action-bar
949639 Move CanAddURI to nsAndroidHistory
949659 UITour: When highlighting item in menu panel, hiding the menu does not hide the highlight
949667 crash in mozilla::net::HttpChannelParent::OnStartRequest(nsIRequest*, nsISupports*)
949720 Intermittent Shutdown | Exited with code 11 during test run | application crashed [@ mozilla::places::AsyncGetFaviconURLForPage::Run()] after "Assertion failure: ((bool)(__builtin_expect(!!(!NS_FAILED_impl(rv)), 1)))"
949722 Assigning to ".onerror" of XHR appends an event listener, rather than overwriting it (only in workers)
949740 Intermittent Android x86 We have not been able to establish a telnet connection with the emulator
949815 Intermittent TEST-UNEXPECTED-FAIL | webconsole/test/browser_webconsole_bug_651501_document_body_autocomplete.js | Timed out while waiting for: autocomplete shows document.body
949843 Don't use "char* str = NS_ConvertUTF16toUTF8(aBdAddress).get();"
949855 No sound comes out when FM Radio is in the foreground and trying to play while Music app is playing in the background
949876 B2G RIL: setRadioEnabled bug in concurrent cases
949907 webrtcUI.jsm (handleRequest): can't access dead object
949913 Don't store page refreshes as history visits
949930 CameraControl.sensorAngle doesn't return consistent angle among different devices
949940 Compartment mismatch: Object.create(frameWin).self
949946 "Assertion failure: !domainInfo->mSharedWorkerInfos.Get(sharedWorkerScriptSpec)"
949968 Intermittent TEST-UNEXPECTED-FAIL | chrome://mochitests/content/browser/browser/devtools/debugger/test/browser_dbg_variables-view-override-02.js | Test timed out
949982 [Gaia][DSDS] Fine tune SIM manager UI
950000 Crash [@ nsUserFontSet::CheckFontLoad]
950026 Bail out safely when we get an unexpected value from AudioClient::IsFormatSupported
950046 [holly] Empty row in Web Developer Menu on Windows
950072 Metro "View Source" menu item should open a "child" tab
950075 Defect - Form history autofill suggestions (and "undefined") replace what I'm typing unpredictably
950105 [Wap push] SI messages which contain '&' symbol in the URL are not received
950113 canvasmark 5% regression on 10.6 machines
950124 Powersave filters are not working in with wifi
950129 inconsistent OCSP fetching policy when verifying OCSP responses
950132 Selected stylesheet (page style) not always restored on lazy-loaded tabs
950159 Keep tabs from other windows in desktop when switching to metro
950180 window.innerWidth is not up-to-date in window.onresize listener
950203 ANR: Frequent hangs in GLController.updateCompositor
950220 Unable to change Bluetooth device name from Settings UI
950225 [B2G][Calendar]When adding a Yahoo or Caldav account hidden buttons in the background can be pressed
950235 Crashes at mozilla::layers::TextureParent::RecvInit() or mozilla::layers::TextureHost::Create(mozilla::layers::SurfaceDescriptor const&, mozilla::layers::ISurfaceAllocator*, unsigned int)
950237 Fennec's geolocation "stumbling" code needs to use the new JSON report format
950240 OCSP response is fetched even when the same valid Good OCSP response has been stapled
950241 Takes two tries to start up Firefox in Touch mode
950254 Context menu of urlbar doesn't get opened without a sleep(0) call in testAwesomeBar\testPasteLocationBar.js
950268 "delete or distrust" on a root CA cert doesn't persist across restarts
950288 Defect - After closing Metro Firefox, the tile launches desktop Firefox
950300 The main panel of the solitary view of "12 Games in 1" is pannable while playing
950301 Crash while panning in UI Tests -> Scrollbars
950307 [DSDS] Settings: rename sim-manager-outgoing-data-desc
950320 Only one window restored after a crash.
950337 Random failures in privatebrowsing/test/browser/browser_privatebrowsing_cache.js | Memory cache reports some entries from example.org domain
950342 Random failures in toolkit/components/places/tests/browser/browser_visituri_privatebrowsing_perwindowpb.js
950343 Bug 938528 broke non USE_SKIA_GPU builds
950367 random failures in test_bug462106_perwindow.xu
950416 test_background_blend_mode.html will be permaorange when 28 merges to beta
950418 sticky-legend-1.html will be permaorange when 28 merges to beta
950427 caretPositionFromPoint and elementFromPoint leak information about iframe contents via timing information
950430 Intermittent browser_webconsole_chrome.js | Test timed out
950435 Intermittent browser_pluginnotification.js | This test exceeded the timeout threshold. It should be rewritten or split up.
950438 Assertion failure: Double input should be equal or higher than Lowerbound., at jit/IonMacroAssembler.cpp
950445 ACE Stream plugin won't start in Firefox 28
950452 Assertion failure: MIR instruction returned value with unexpected type, at jit/IonMacroAssembler.cpp:1219
950456 Assertion failure: [infer failure] Missing type in object [0x7f68c2d39858] value: [0x7f68c2d39698], at jsinfer.cpp:285 with Map
950460 Crash [@ js::BarrieredValue::writeBarrierPre] or Crash [@ markIfUnmarked] or Assertion failure: addr % CellSize == 0, at gc/Heap.h:1081 or Crash [@ operator->()]
950462 Assertion failure: false (MOZ_ASSUME_UNREACHABLE(unexpected type)), at jit/Lowering.cpp:1696 or Crash [@ js::jit::LIRGenerator::visitToDouble]
950464 Select-All button in text-selection action-bar copies text instead of selecting text
950483 Close Developer Toolbar button is not shown properly
950487 Overzoom when rotating an application from portrait to landscape
950488 Application is not repainted correctly when an element is going fullscreen
950489 While changing the range of an input type range the page is moving as well
950490 box-shadow with "transform: rotate" is not rendered properly
950511 OS X Context Menu uses incorrect Antialiasing Settings even on non-HiDPI screens
950513 assertion in StartOffThreadParseScript when JS_WORKER_THREADS is false
950531 --with-libxul-sdk builds broken by bug 935881
950565 Intermittent browser_webconsole_bug_782653_CSS_links_in_Style_Editor.js | Test timed out
950590 canvas rendering context does not respect dynamic changes to the user font set
950610 Add "Share" and "Add to Home Screen" to pinned sites context menus
950696 Cache pref for whether to enable tiled thebes layers
950719 Bing search icon is larger than other default search icons
950731 Firefox reliably crashes (in image decoding), when running WebGL game
950800 Toggle HwcComposer2D on the fly
950832 OSK not appearing on the first tap when filling in input fields
950858 MOZ_CRASH("impossible cipher suite") hit in Firefox 26 release
950873 Switch Social.jsm to use asynchronous Promise.jsm
950888 crash in ExperimentRunner::Run() at startup
950891 [Monkey Test] IPC Crash mozilla::ipc::RawDBusConnection::SendWithReply on jb_gonk
950909 Native aggregation is silently dropped when an XPCWrappedJS already exists for the target JSObject
950930 Crash in nsXBLProtoImplAnonymousMethod::Execute()
950986 "Windows 8 Touch" (switch to Metro) not appearing in Australis menu panel or customization UI on a Windows 8 tablet
950993 position:fixed CSS rule fails to keep marketplace header at top of browser
951028 Downloaded files don't inherit NTFS permissions from the parent folder/directory
951088 [Flatfish][Buri][Gallery] Black screen shown when opening Gallery
951113 Application is not repainted correctly when the keyboard is dismissed once the screen is off
951117 [RTSP][Video][V1.3] Crash happened while stop playing RTSP streaming.
951120 Thread manager shutdown hang when running metro mochitests
951142 Intermittent browser_browserDrop.js | uncaught exception - TypeError: this.close is not a function at chrome://global/content/bindings/findbar.xml:1168 | Test timed out
951146 Intermittent browser_webconsole_console_logging_api.js | Timed out while waiting for: 1 message shown for exception (logging turned on)
951175 [RTSP][V1.3] Disabling network on the hotspot will cause a system hang while FxOS is playing RTSP streaming
951177 [Contacts] Exporting a contact to SIM card is not working fine under some circumstances
951188 [RTSP][V1.3] No error notification when the RTSP link fails to load
951216 Avoid unnecessary Snapshot() copies by clearing the pattern in gfxSurfaceDrawable
951237 Custom preferences are not reset in testSoftwareUpdateAutoProxy test
951244 [ga-IE] Test failure 'TabView is not open.' in /testTabView/testToggleTabView.js and /testTabView/testTabGroupNaming.js
951245 Forwarding to outer should probably check for active document, not current inner
951260 Social Status button icon stretched on retina screen
951264 COPPA support for Firefox Accounts on Android
951268 SourceAlpha testcase has stopped working
951290 [B2G] [Browser] The first swipe after zooming has no effect
951310 min-height and max-height don't work with number inputs
951320 The requested displayport is sometimes wider than the page
951321 [B2G][Messages] Create New Message button gets selected but does not open New Message page
951354 ASan: Crash with heap-use-after-free when running xpcshell test getHSTSPreloadList.js
951366 Assertion failure: obj, at dist/include/js/Value.h:527 or Crash on Heap with gcPreserveCode
951413 Intermittent browser_dbg_conditional-breakpoints-03.js | leaked until shutdown [nsGlobalWindow #xxxx http://example.com/browser/browser/devtools/debugger/test/doc_conditional-breakpoints.html]
951431 Monitor main thread hangs using BackgroundHangMonitor
951453 Capabilities are not in sync with webdriver spec
951463 Rename ClampRect to be more meaningful
951465 update Google/Yahoo/Wikipedia icons to have better icon sizes
951467 make scroll layer items report the correct bounds and visible region
951491 Monster Madness always leaves a ghost window
951497 Crash [@ js::jit::AssertValidStringPtr] or Opt-Crash [@ js::EqualStrings]
951517 Crash at a weird memory address involving FakeDOMObject
951518 Fix whitespace on Connect page
951527 OdinMonkey: Crash [@ js::CallJSNative] or [@ js::Invoke]
951528 Crash [@ js::assertSameCompartment] or [@ js::ScopedThreadSafeStringInspector::ensureChars]
951547 content/smil/nsSMILTimedElement.cpp: [-Wsometimes-uninitialized] variable 'activeTime' is used uninitialized whenever 'if' condition is false
951573 Assertion failure: (uint32_t)(const uint32_t *)val == uint32_t(expectedValue.value), at jit/arm/Assembler-arm.cpp
951605 Regression: EV green lock and non-EV gray lock swapped
951635 Removing animations from tile swipes in snapped view
951655 [Holly] Perma orange browser_social_workercrash.js | Test timed out
951675 New data collected by the frame script is ignored as long as we don't invalidate the TabStateCache
951725 Save session state before switching to Metro
951732 [B2G][Video] When tapping on playing video it starts flickering
951766 [Contacts API] Reimplement the "mozContact.prototype.init" method for the sake of backward compatibility
951770 Reject invalid WebM/Opus files
951782 Firefox 26 for Android crashes on HTC Desire Z due to on-demand decompression
951827 startup crash in CryptBaseRunOnceRoutine coming from random_generateSeed in jsMath - some software is hooking LdrLoadDll in a broken way after Mozilla's hooking
951875 Respect binaryNames in JS-implemented interfaces
951908 Content processes never shutdown in some cases
951988 Assertion failure: mir->fallible(), at jit/arm/CodeGenerator-arm.cpp
952006 [RTSP][Video] System crash while RTSP reconnecting
952022 Crash [@ js::AsmJSModule::detachIonCompilation] or Assertion failure: exit.interpCodeOffset_, at jit/AsmJSModule.h
952042 Focus ring remains forever, and indicate wrong element
952043 [B2G] [Gecko] To provide the network types supported by platform for Gaia.
952052 Intermittent TEST-UNEXPECTED-FAIL | /tests/content/media/test/test_mediarecorder_record_session.html | application terminated with exit code 11 | application crashed [@ nsDOMEventTargetHelper::Release()]
952112 Share button in text-selection action-bar is incorrectly scaled
952116 crash in mozilla::TimeDuration::operator>(mozilla::TimeDuration const&)
952121 Nightly uninstaller doesn't unregister the command execute handler properly
952125 Master Dialog Modal is hanging in /restartTests\testPreferences_masterPassword\test2.js
952170 FX OS crash in mozilla::dom::TabChild::UpdateTapState(mozilla::WidgetTouchEvent const&, nsEventStatus)
952180 BrowserUITelemetry is mostly returning empty toolbar data.
952217 [B2G][NFC] Have a separate NFC application API and NFC Manager API
952220 Cannot send a blob from a FxOS phone to a connected remote peer via Data Channels
952235 SVG is broken
952259 Basic automated tests for Metro sessionstore component
952270 Crash [@ nsSVGTextFrame2::GetTextPath]
952297 Left scroll arrow in the Metro tab strip is visible even when tab strip is not scrollable
952321 crash in mozilla::dom::DocumentBinding::genericMethod
952324 Tab modal prompts fail to accept touch input if opened during a touch input event
952335 [OS.File] Can't link with lz4 on some platforms
952338 crash in nsIDocument::InnerWindowID()
952365 Bug 932322 breaks dell.com
952371 [B2G] [DSDS] mozMobileconnection.lastKnownNetwork and .lastKnownHomeNetwork aren't working
952386 [wasabi][CDMA] UIM card can only be detected after flashing build and once reboot device, UIM can't be detected.
952473 SessionStore should only watch for top-level pageshow events
952567 [australis-measuring] Capture which Australis Update experience URL was received by a user
952568 [australis-measuring] Determine if Australis Update experience tab is active
952582 Bookmark item is sole item in row of menu of guest-browsing
952592 Collect sizemode from first window in BrowserUITelemetry
952602 Disable bug 757726 for Firefox 28 release (changes to plugin detection)
952663 Create tests for expected tab strip behavior
952693 The Nuwa process should never be OOM killed
952736 "Ukrainian" typoed as "Ukranian" in the charset autodetector menu
952753 Australis: Toolbar buttons with type "menu-button" don't work correctly with Widget Overflow popup panel.
952756 Heap-buffer-overflow in mozilla::dom::AudioBufferSourceNodeEngine::CopyFromInputBuffer
952780 Assertion failure: runtime->isAtomsZone(str->zone()) || str->zone() == obj->zone(), at gc/Marking.cpp or Assertion failure: (str)->zone()->isGCMarking() || (runtime)->isAtomsZone((str)->zone()), at gc/Marking.cpp
952783 Crash in Telephony while running MO sms test script
952800 Intermittent TEST-UNEXPECTED-FAIL | browser_form_auto_complete.js | autofill item list length mismatch, some items were not found. - Got 5, expected 6
952823 Crash [@ js::jit::IonBuilder::processReturn] or [@ js::jit::IonBuilder::traverseBytecode] or [@ js::jit::AttachFinishedCompilations] or [@ js_InvokeOperationCallback] or Assertion failure: args_[i]->isPassArg() == wrapped, at jit/IonBuilder.h
952835 screen goes to sleep while video still playing in Metro Firefox
952846 Don't ship unused PDF.js files in metro installer
952865 Intermittent browser_console.js | Timed out while waiting for: messages displayed | jsterm eval result is displayed - Didn't expect -1, but got it
952874 Telemetry collection for RSA/DHE key sizes of 1025-1280 bits is wrong
952876 Add test for bug 952808 (OCSP stapling not honored when there is a error entry in the OCSP cache) to Gecko test suite
952878 LayerRenderer.drawBackground can be expensive during a pageload
952893 [B2G] AudioStream (from AudioDestinationNode) Continues to Write Silent Samples until Killing the Dialer App
952894 Use existing triggers to clear open search engines state
952906 "Close" button icon for autocomplete isn't visible
952961 Firefox 26+ does not mark downloaded non-executables as coming from Internet zone
952984 Crash [@ js::gc::Cell::chunk] or [@ js::GCMarker::drainMarkStack] or Assertion failure: addr % CellSize == 0, at gc/Heap.h
952989 Sliding in Windows Charm while OSK visible on top of Find App Bar will re-appear when selecting "Options"
952993 Screen isn't wrapping all the way to the top when using the OSK to search for next instance
953005 [B2G] enhance the initialization of MobileConnectionArray to improve performance
953034 [Bluetooth][Certification][PTS][Bluedroid][1.3] AVRCP TC_TG_NFY_BV_04_C Failed
953036 [Bluetooth][Certification][PTS][BlueZ][1.3] HSP TC_AG_IAC_BV_01_I Failed
953045 [Bluetooth][Certification][PTS][BlueZ][1.3] AVRCP TC_TG_RCR_BV_02_C Failed
953104 OdinMonkey: Assertion failure: !elems_.empty(), at jit/AsmJS.cpp:1213 or Crash on Heap
953108 Assertion failure: v.isObject(), at vm/GlobalObject.cpp:42 or Crash [@ operator->]
953111 Assertion failure: objTypeReprs.kind() == TypeRepresentation::SizedArray, at jit/IonBuilder.cpp:6766 or invalid write [@ js::TypedObject::createZeroed]
953114 Assertion failure: MIR instruction returned value with unexpected type, at jit/IonMacroAssembler.cpp:1223
953120 Assertion failure: pushedAtCycle_ == -1, at jit/shared/MoveEmitter-x86-shared.cpp:259
953130 bug 920325 broke --with-system-nspr
953153 [Linux] Download button resizing itself horizontally when the overlay loads (clicking the button, downloading something, etc.)
953159 FM radio tries to play even when there is no antenna
953215 Optimize per pixel alpha blending in H/W Composition.
953246 gdk-screenshot.cpp:80:32: error: ‘nullptr’ was not declared in this scope
953270 Assertion failure: JSVAL_IS_DOUBLE_IMPL(l), at js/Value.h:406 or Assertion failure: l.asBits <= JSVAL_SHIFTED_TAG_MAX_DOUBLE, at js/Value.h:636 or Crash [@ JSObject::getGeneric] or Crash [@ getClass] with SIMD
953282 Sync scheduling is wrong
953288 jank when typing in the url bar
953303 HwcComposer2D should honor HWC_HINT_CLEAR_FB set by hwcomposer.
953312 Places expiration code still waits for "back", not "active", from nsIdleService
953334 text-shadow issue with hardware acceleration enabled
953346 Intermittent testSimpleDiscovery | GeckoEventExpecter - blockForEvent timeout: Robocop:Status
953373 Assertion failure: MIR instruction returned object with unexpected type, at js/src/jit/IonMacroAssembler.cpp:1223, loading Amazon product page
953394 No H.264 video is displayed - unknown video color format: 0x7fa30c04/QOMX_VIDEO_CodingVp
953430 tapping on completed download button under about:start produces a blank app bar
953433 download button using two different colors after completing download
953993 Fennec leaks profile path to logcat
955161 HTTP 302 Redirects not working with SPDY enabled
955699 Error linking WebRTC LINK : fatal error LNK1104: cannot open file ...Unified_cpp_ate_estimator_components_rbe_components0.obj
955820 console.group doesn't group messages when timestamps are disabled (i.e. by default)
955850 Assertion failure: safepoint->hasNunboxPayload(alloc), at jit/RegisterAllocator.cpp
955861 Long-tapping on reader mode toolbar icons triggers text selection mode
955886 Title bar is visible in fullscreen with "Hide title bar when scrolling" unchecked when using document.mozFullScreen
955889 EnsureKeywordsHash no longer takes advantage of caching
955906 Permissions are not granted for packaged apps
955911 Heap-use-after-free in mozilla::MediaStream::ChangeExplicitBlockerCount
955913 Heap-buffer-overflow in mozilla::css::Declaration::GetCustomPropertyNameAt
955950 Preference to disable/select the number of days until recommending a reset
956067 Infinite recursion and startup crash in GetDynamicChildren in docshell/shistory/src/nsSHistory.cpp
956075 Long-pressing at top of page with URL bar hidden triggers URL bar context menu
956138 Have BrowserUITelemetry wait for sessionstore-windows-restored before gathering measurements
956156 Assertion failure: actual->isSubset(frozen), at jsinfer.cpp
956173 Assertion failure: !val.isMagic(), at jit/BaselineIC.cpp
956186 Don't use hiddenwindow.html on b2g
956201 Intermittent PROCESS-CRASH | test_mediaDecoding.html | application crashed [@ mozilla::dom::AudioNode::SendDoubleParameterToStream(unsigned int, double)]
956202 Intermittent TEST-UNEXPECTED-FAIL | browser_UITour.js | This test exceeded the timeout threshold. It should be rewritten or split up. If that's not possible, use requestLongerTimeout(N), but only as a last resort.
956284 Fault in cycle collector: overflowing refcount
956286 nightly started from taskbar icon doesn't get startup focus
956322 Trying to download an MMS fails with 'Missing SIM card'
956325 crash in mozalloc_abort(char const*) | NS_DebugBreak | mozilla::dom::ContentChild::ProcessingError(mozilla::ipc::HasResultCodes::Result)
956368 [session store] Tab Groups lost after switching from desktop to Metro and back
956398 Support text relocations for Flash
956420 header on Twitter scrolls incorrectly when viewing images
956424 [B2G][Settings][SIM Security] SIM Security enabled/disabled information in "Settings" shows wrong information
956428 JavaScript Error: "conn.getPreferredNetworkType is not a function"
956432 [B2G] CutTheRope, does not display correctly during gameplay.
956434 Intermittent TEST-UNEXPECTED-FAIL | testArrayBufferSlice.js | --no-baseline --no-ion | 8:12 Error: Assertion failed: got 16, expected 43
956442 Include Firefox version in desktop client records
956443 Include Firefox version in Android client records
956462 GMail tab are restored to the one state before the actual state
956468 ReferenceError: assignment to undeclared variable res nsUpdateService.js
956470 dom/bindings/ErrorResult.h: [-Wuninitialized] 'ErrorResult::mMessage' may be use uninitialized in this function
956491 Don't use Toolbar-inverted.png for the tabbar on Win7 glass (without lwtheme)
956524 hanging tab allows attackers to execute JS for a long time in the background, user is not able to close firefox normal
956581 RuntimeException (NPE) in selecting 'Firefox Account' in Android's Settings
956605 about:accounts page indicating email needs verification doesn't change on verification
956690 Sometimes the screen goes blank when scrolling fast through large pages
956704 "Acid Defender" WebAudio game audio doesn't continue playing after canceling the multiple tabs warning
956705 Regression: throbber does not spin
956741 Load first run on start page for the first 3 tabs
956782 Swap Search and Share in Text-Selection Action Bar
956833 Clear manifests cache on memory pressure
956841 [B2G][Dialer][Bluetooth] Navigation perf occurs while within a bluetooth call
956935 Include supported Sync protocol versions in Android client records
956936 Include supported Sync protocol versions in desktop client records
956939 Black space under URL bar when scrolling
956967 Crash loop in [@ PathFromRegionInternal ] with gfx.content.azure.backends empty and layers.prefer-d3d9=true
957004 Assertion failure: !hasLazyType(), at vm/ObjectImpl.h
957021 Memory reporter paths are all screwed up
957112 The inclusion of a comment inside of search.xml has caused the engine popup to move inside the DOM tree
957131 Synced bookmarks appear in guest mode but not in default profile
957150 Errors restoring session in Metro mode if it contains navigation within a document
957151 Fix home button styling in bookmarks bar on Linux
957162 Marionette waits should include the timeout duration when throwing TimeoutException
957188 [APZC] The click events are lost in some situations
957228 Intermittent TEST-UNEXPECTED-FAIL | browser_panel_toggle.js | Uncaught exception - Panel did not show within 20 seconds.
957236 new mozRTCPeerConnection(); - 100% CPU
957256 crash in mozilla::scache::StartupCache::WriteToDisk()
957258 crash in sprotector.dll@0xb343f
957346 [B2G][Music]The music application terminates when playing the game "Poppit"
957359 Intermittent webaudio mochitest | Assertion count N is greater than expected range (Shouldn't have already notified of finish *and* have output!: '!streamHasOutput[i] || !stream->mNotifiedFinished')
957391 [B2G][Game Pack] Backing out of a game will lead to a blank page in the Game Pack app
957437 crash in mozilla::widget::GfxInfo::GLStrings::EnsureInitialized()
957439 MediaRecorder: "Assertion failure: NS_IsMainThread() && mTrackUnionStream" [@mozilla::dom::MediaRecorder::Session::Pause]
957452 MediaRecorder: use-after-free crash [@mozilla::dom::MediaRecorder::Session::GetEncodedData]
957475 B2G crash on bild.de - js::NewObjectWithClassProtoCommon(js::ExclusiveContext*, js::Class const*, JSObject*, JSObject*, js::gc::AllocKind, js::NewObjectKind)
957562 Browser crashes on trying to modify the Graph values - WebGL Animations
957572 Wifi failed to Turn on after Wifi-Hotspot is turned on/off
957588 Bookmark navbar button is checked for non-metro bookmarks
957592 Downloads API needs to pass DOM peer review
957665 Add telemetry to measure how many people have OCSP enabled
957666 Frequent "System JS : ERROR (null):0 - uncaught exception: 2147746065" spammed during desktop mochitest runs, coming from httpd.js (nsIHttpResponse.write)
957667 De-couple OCSP stapling pref from the OCSP fetching pref, and couple the OCSP required pref to the OCSP fetching pref
957694 Hang/deadlock with Flash on 4.4 on Tegra3
957704 Change apikey parameter name from "apikey" to "key for SafeBrowsing requests
957759 Remove experiment to test reachability of SRV records
957790 B2G: Settings app can be zoomed-in during startup
957800 Intermittent test_peerConnection_offerRequiresReceiveVideoAudio.html,test_peerConnection_basicAudioVideo.html,test_peerConnection_basicAudioVideoCombined.html,test_peerConnection_offerRequiresReceiveAudio.html | Have localcandidate stat(s)
957806 Stylize the Bad URL Error Page - Implementation
957828 Reduce the number of copies involved in sending IPC Messages
957841 MediaRecorder crash [@ mozilla::dom::MediaRecorder::Session::AfterTracksAdded]
957872 Remove SyncAdapters for all but the main Fennec ContentProvider
957894 Update account pickling code for Firefox Account
957949 [Bluetooth][HFP] Add B2G common bluedroid config file
958008 Avoid copying images on Android/Gonk when there's nothing to optimize
958011 Worker object cycle collection is broken
958080 crash in abort | wassert
958108 Webapps crash (hang) on start because of missing ICU delayload DLL
958109 Overlapping of checkbox and label on prompt
958166 "browser is not defined" error in SessionStore.js when saving a session with tab groups
958170 Intermittent unresponsive blank white content on about:start on startup
958234 xptcall build broken on powerpc after bug 932178
958311 Assertion failure: progress <= progressMax
958358 make "webapp" capitalization consistent
958447 Client support for tokenserver backoff protocol
958549 Settings app appears to not scroll when first opened
958561 Measure usage of Sync in health report
958666 Autofocus is delayed until first user interaction on fxos
958674 Panels flicker when appearing
958687 Intermittent browser_inspector_pseudoclass_lock.js | pseudo-class in infobar selector - Got , expected :hover
958709 swiping away webapp from Recents screen doesn't stop it
958726 Perform shrinking GC if nsJSContext::GarbageCollectNow is called with aShrinking == ShrinkingGC.
958771 Intermittent TEST-UNEXPECTED-FAIL | crashtests/336744-1.html | application timed out after 330 seconds with no output
958780 B2G Crash during FTU
958809 Privacy level may be ignored for broadcasted data
958867 Make sure to call HoldJSObjects when setting IDBFactory::mOwningObject
958869 Stop showing toolbar context menu on Australis widgets panels
958882 Firefox and computer freeze with high CPU use when opening http://pythonfiddle.com/
958883 Use HTTPS for Yahoo searches
958891 Make Fennec about:home advertise Firefox Accounts + Sync banner
958899 Under Windows, cannot use a root directory as the destination for downloading
958900 Schedule a periodic sync for new FxAccountSyncAdapter
958916 Update to NSS 3.15.5
958963 FM App does not recognize wired headset for the first time after boot up
958966 Intermittent browser_webconsole_bug_653531_highlighter_console_helper.js | inspector is highlighting
958977 heap-buffer-overflow (read) at mozilla::gfx::FilterProcessing::ApplyMorphologyHorizontal_SSE2
958980 crash in js::SN_IS_TERMINATOR(unsigned char*)
958993 taping "Clear" button under "Options" several times creates multiple modal prompts
959007 firefox crashes when starting html5 web player
959026 Add telemetry for OCSP fetching
959070 Intermittent TEST-UNEXPECTED-FAIL | /tests/content/events/test/test_bug667612.html | application terminated with exit code 1 | PROCESS-CRASH | /tests/content/events/test/test_bug667612.html | application crashed [@ mozilla::dom::workers::WorkerRunnable::R
959111 Connecting dev-tools to the Firefox OS remote debugging allows chrome script execution
959119 Assertion failure: store->index()->type() == MIRType_Int32, at jit/TypePolicy.cpp:783 or Crash on Heap near [@ EnterIon] with StructType
959128 incorrect path transform being used within SVG-in-OpenType glyph
959130 don't use a ChromeWorker to read the session file at startup
959142 Jetpack permanent orange on holly because of reliance on CustomizableUI.jsm import
959147 Search Results Overlay Minimum Results has Two Blank Tiles
959167 Crash [@ runtimeFromAnyThread] or Crash [@ operator->()] due to unhandled OOM in [@ js::CloneRegExpObject]
959172 Crash Reports for mozilla::net::SpdySession31::CleanupStream
959198 [APZC] Keyboard disappears after typing first letter
959199 [APZC-only] Calling "preventDefault" on the contextmenu event does not prevent the click event.
959222 Make browserid_identity a first-class identity module
959223 Flash plugins are not resized correctly according to resolution
959230 paymentFailed/paymentSuccess not available in webpay
959242 Make mozbrowser's sendTouchEvent work with APZC enabled iframes
959244 APKs installed from anywhere except the marketplace fail to run.
959333 Change HTTP version in synthesized headers for HTTP/2
959393 about:start rendering anomaly while scrolling (aurora only)
959396 MetroFx sometimes gets into state where the pref "browser.sessionstore.resume_session_once" is stuck to "true"
959399 Firefox users who switch to metroFx and close the browser will lose their sessions
959439 svg filter effects freeze firefox
959497 [DSDS] SIM operator name in SIM Manager will not be updated when SIM status is changed.
959502 heap-buffer-overflow (write) at mozilla::gfx::ConvertToB8G8R8A8_SIMD
959531 settings & history ID bug
959585 contentEditable span or div onblur alert can't be clicked
959615 crash in mozilla::layers::CompositableParentManager::ReceiveCompositableUpdate(mozilla::layers::CompositableOperation const&, std::vector<mozilla::layers::EditReply, std::allocator<mozilla::layers::EditReply> >&)
959640 Have a default icon for add-on SDK widgets in customization view
959655 Some buttons are never enabled on http://pythonfiddle.com/
959719 Add support for HWC_BLIT composition in HwcComposer2D.
959774 ToS and Privacy Notice links for FxA
959781 [FTE] Scrolling though Your Privacy E.me page causes very bad text overlapping (with APZ enabled)
959784 Submitting empty create account form displays Java error
959792 On the nav bar edit, can't drag selection monocles for bad domains
959794 Validate password length
959800 [Offline] mozbrowser iframes don't display correct offline content
959886 Handle offline cache updates in parent process after windows are being torn down in child processes
959945 JavaScript Warning: "Unknown property 'box-sizing'. Declaration dropped." {file: "resource://gre-resources/html.css"
959962 [DSDS] Description of Enter PUK code page is cut on the right, it's not centralized.
959971 [DSDS] Enter incorrect PIN code 3 times in SIM Manager > SIM security, next page is still in Enter SIM PIN with "-1 tries left" words on it.
960017 heap-buffer-overflow (read) at mozilla::gfx::ColorComponentAtPoint
960046 [OS.File] makeDir should not fail if the directory is a root
960047 Sync banner promo links in bookmark/add-on panels need to continue working; consider re-setting sync counts
960088 Initialize the observer right away in start method in firefox/lib/modal-dialog.js
960135 local file access via Open Link in new Tab
960144 Toast Notifications Image - Implementation
960145 range analysis for phi nodes ignores OSR values
960146 Preventing scrolling also prevents re-showing hidden address bar
960162 Intermittent Shutdown,testSystemPages | application crashed [@ libGLESv2_POWERVR_SGX540_120.so + 0x4904]
960178 heap-buffer-overflow (read) at mozilla::gfx::(anonymous namespace)::PowCache::Pow
960224 [b2g][music] music regressed 50ms on datazilla cold launch time (Jan 15)
960245 Deal with the final possibility for degeneracies in FindInflectionApproximationRange
960277 absolutely positioned content in <legend> does not receive pointer events when its <fieldset> is an abs-pos container
960296 Video freeze during WebRTC call
960309 figure out how to make browser_tabview_bug625269.js pass reliably with Bug 930793 fixed
960351 browser_bug726427_csstransform_tooltip.js | Test timed out
960354 Multi-select drop down menus don't update properly
960359 Home banner will never show up if user disables "Top Sites" panel
960416 Always use JIT hardening (i.e. remove javascript.options.jit_hardening pref code)
960509 32bit mode of Firefox 29.0a1 is busted on OS X
960517 Adjust Australis's browser theme for Windows 8 and up
960527 eglMakeCurrent:671 error 3009 (EGL_BAD_MATCH) - creatures-of-gaia.com
960565 mozilla::layers::GestureEventListener gets into inconsistent state when pinching
960571 switch to https for build/test downloads and hg
960601 Installing privileged app with origin in the manifest doesn't work
960603 Uninitialised value use relating to nsJSContext::EndCycleCollectionCallback
960605 Investigate the frequent OSX 10.8 debug mochitest-4 shutdown hangs
960641 Queue browser API calls before remote frame is shown
960692 Firefox crash in igd10iumd32.dll within mozilla::layers::CompositorD3D11::BeginFrame
960694 Support serializing JS implemented objects in nsBinaryOutputStream
960741 messages app fails to upgrade database (JS exception in upgradeSchema14) after updating from 1.2 to 1.3
960768 Compartment mismatch in js::UnwindIteratorForException
960781 Ensure software update tests can handle new final release process (Beta N -> RC N -> Beta N+1)
960811 enable synthetic APKs by default in Fennec builds
960864 Placeholder text disappears in SearchBar after customize
960886 selection monocles being spilled over to other tabs when switching
960889 monocles moving when swiping up/down through gmail email draft
960962 OS.File normalization and concatenation issues on Windows
960999 Intermittent TEST-UNEXPECTED-FAIL | chrome://mochitests/content/metro/browser/metro/base/tests/mochitest/browser_form_selects.js | option is selected
961007 [CostControl] Data mobile usage is not counted, the value is always 0.00 B
961041 infallible-OOM crash from DOMStorage::BroadcastChangeNotification should be fallible
961047 Ensure all mozbrowser iframes use APZ when APZ is enabled.
961051 Intermittent browser_console_addonsdk_loader_exception.js | This test exceeded the timeout threshold. It should be rewritten or split up.
961106 many author-style-disabled-changed observers build up during a browser-chrome test run
961123 Higher-resolution overlay button icons - Implementation
961124 High CPU use on http://pythonfiddle.com/
961135 Firefox Accounts Setup (Account Creation) - needs a larger year range
961157 Tiles not working/opening www.metrobrowser.com if firefox not yet running and profilemanager popping up (not auto-use of last profile)
961162 Intermittent test_networkstats_service_proxy.js,test_mms_pdu_helper.js,test_networkstats_db.js | test failed (with xpcshell return code: -1) | Process still running after test!
961170 Firefox Accounts (Sign In) - java.lang.NullPointerException on 'Forgot Password?'
961176 Firefox Accounts (Sign-In) - On sign-in, mentions account creation
961177 given argument incorrect for alertDownloadSave2
961198 Firefox Accounts - State of what is to be synced is not preserved
961223 Character encoding in app bar: implement it or remove it from Options
961271 [B2G][Contacts]Importing a contact whose phone number has special characters from a SIM replaces the spaces with zeros.
961280 Scrolling in Metro Firefox with mouse wheel, trackpad, or keyboard abruptly becomes very slow
961318 Random big delays (up to 5-10s) when opening new windows/chrome documents
961347 Google translate can't expand its input area with large input
961375 Label for "Hide title bar when scrolling" pref is cropped in portrait mode
961479 Cached thumbnails of pending tabs are discarded when opening Panorama
961489 xhtml <select> element fails (regression) in Mobile/Android FF
961494 Assertion failure: obj->inDictionaryMode() || parent->hasMissingSlot() || child.slot() == parent->maybeSlot() + 1, at vm/Shape.cpp
961498 Crash in java.lang.ClassCastException: org.mozilla.gecko.favicons.decoders.ICODecoder$ICOIterator cannot be cast to org.mozilla.gecko.favicons.decoders.FaviconDecoder$SingleBitmapIterator
961499 Regression: Home-Screen shortcuts added from top-site thumbnails merely show the common bitmap colour and not an actual-site favicon
961512 WebRTC permission prompt can show the wrong domain name, potentially making it possible for the page to spoof the domain name the access to the webcam/mic is requested from
961521 Remove Launcher from FxAccountStatusActivity
961523 Refine home banner close button behavior for snippets
961526 crash in android.database.sqlite.SQLiteConstraintException: foreign key constraint failed (code 19) at android.database.sqlite.SQLiteConnection.nativeExecuteForLastInsertedRowId(Native Method)
961528 HSTS is enforced on apis.google.com sub-domains and hosts yet only works for apis.google.com itself (awstats no longer shows charts)
961560 Create/use a SUMO topic redirect for the missing plugin URL
961612 [AccessFu] Explore by Touch uses wrong coordinates on HiDPI Android devices
961613 Button's icons are displayed incorrectly on HiDPI display
961621 Intermittent TEST-UNEXPECTED-FAIL | chrome://mochitests/content/browser/browser/devtools/webconsole/test/browser_webconsole_bug_766001_JS_Console_in_Debugger.js | Timed out while waiting for: correct source and line test for debugger for index 2
961672 Holly perma-orange mochitest-other | toolkit/content/tests/widgets/test_menubar.xul | Test timed out.
961676 Unsafe temp directory usage in maintenservice_installer.exe lead to possible privilege escalation
961727 Adjust popup padding on Windows to 4px
961746 [Dialer] When I insert three times invalid PIN I can't see PUK1 screen
961749 (Nexus 7 2012) - The tabs button is wrongly displayed after open a link in new tab
961762 A manifest.webapp file is downloaded and the web app is loading forever when trying to launch a web app
961773 crash in java.lang.NullPointerException: at org.mozilla.gecko.home.TabMenuStrip.onPageSelected(TabMenuStrip.java)
961785 [Contacts][Facebook] Picture (photo) of Facebook contact and Facebook symbol are missing after closing app during Facebook sync
961787 Glitches when using MediaElementAudioSourceNode/mozCaptureStream from a media decoder
961793 BrowserElementChildPreload/BrowserElementPanning need to unregister observers
961802 ghost-window appears on https://apprtc.appspot.com/ after selecting "Don't Share"
961860 Intermittent null-deref in Seer::Observe()
961952 HardwareUtils.getMemSize can be expensive during startup
961959 The built-in profiler is broken with Nuwa
962047 Default search engines are not displayed after turning on search suggestions
962099 Intermittent B2G "make[3]: *** [configure] Error 1" due to "configure: error: newly created file is older than distributed files!"
962103 Progress bar visual refinements
962121 Intermittent testPasswordProvider, testFormHistory | application crashed [Unknown top frame]
962140 [Meta] crash in mozilla::widget::NativeKey::RemoveFollowingCharMessage() or mozilla::widget::NativeKey::GetFollowingCharMessage(tagMSG&)
962141 JS crash spike starting with 2014-01-17 Nightly builds
962163 crash in __delayLoadHelper2 | ffi_closure_STDCALL
962229 JS Error on startup - DOMApplicationRegistry: DOMApplicationRegistry: Could not read from json file /data/data/org.mozilla.fennec/files/mozilla/webapps/webapps.json
962236 wrap long tutorial texts on about:start
962256 Exact rooting regressed dromaeo_css and mootools by ~5%
962282 Flip the Metro back button arrows and tab outline in RTL locales
962309 Video RTSP support should be disabled in 1.3
962349 Enable snippets
962393 MessageManager should not use JS_InternString
962452 [DSDS] Enable or disable automatic selection on SIM 1 will also do the same on SIM 2, vice versa.
962478 highlighter event listeners not removed when toolbox closed with highlighter visible.
962514 Test failure 'client process shutdown unsuccessful' in testAddons/testInstallAddonWithEULA.js
962516 datastore.add breaks if a record with an existing id is added
962522 B2G RIL: Enable data connection then enter into no coverage area, the registration status is still 'registered'
962542 Firefox Accounts (Get Started UI) - Bottom support link not hyperlinked
962597 Firefox Accounts (Sign-Up) - Unimplemented re-send confirmation link
962601 Firefox Accounts (Sign-Up) - Remote Error! if you try to use and existing e-mail
962606 Firefox Accounts (Sign-Up) - Suggestions are present for password field
962609 Firefox Accounts (Sign-Up) - 'Terms of Service' and 'Privacy Policy' redirects to mozilla.org
962644 Firefox Accounts (Entry) - Settings → Sync, replace old entry with new entry
962647 inspector search box does not properly show the node in markup view and breadcrumbs
962724 Event listeners don't persist after attach and reopening of Developer Tools
962767 Docshell swapping gets message manager parent wrong
962803 [Australis] resizing private window does not always remove tabbar overflow
962815 Dismissing pin site popup makes the pin button stay highlighted.
962855 [Australis] Scroll bar shown in panelUI with default set on Windows, Linux, Mac
962881 Regression in Scrolling in the Email App w/ APZ on
962884 Offer opt-out from auto-hyphenation for labels in the menu panel
962906 FxA age verification fails until system uptime is greater than 15 minutes
962931 Intermittent TEST-UNEXPECTED-FAIL | browser_webconsole_split.js | This test exceeded the timeout threshold.
963000 Explore By Touch sometimes not working when Firefox is opened and automatically loads a web page
963035 NotificationDB does not close file
963053 crash in mozilla::dom::Gamepad::SetAxis(unsigned int, double)
963077 Assertion failure: hasScript(), at c:\users\mozilla\debug-builds\mozilla-central\js\src\jsfun.h:337
963078 [Australis] Subviews (such as Bookmarks, history, devtools, character encoding, ...) run below the task bar when they are in the panel
963083 Background tabs should inherit the text color
963086 heap-use-after-free (read) at mozilla::PodCopy
963098 [meta] Polish the bookmarks subview and panel
963130 NotificationDB throws with missing this.byTag[origin]
963142 [Camera] Negative picture/video rotation values are incorrectly calculated
963143 No download finished notification if download button is in the menu panel
963160 Firefox Accounts (Sign-Up/Sign-In) Use normalized email addresses where appropriate
963162 getCurrentWindowHandle not matching webdriver command getWindowHandle
963166 getCurrentWindowHandles not matching WebDriver command getWindowHandles
963198 out of bounds read in libxul.so!gfxContext::Polygon
963242 crash in @0x0 | JavaThreadDetachFunc
963316 Crashes in JSObject::is<js::ArgumentsObject>() on Firefox 28 Aurora/Beta
963324 layout/reftests/mathml/menclose-1-ref.html tests the wrong feature
963365 [Australis] Menu panel layout is broken
963444 Link to beta release notes is incorrect
963474 Assertion failure and crash: rc != 0 (destroyed timer off its target thread!), at ../../../xpcom/threads/TimerThread.cpp:259
963475 Provide a way to fetch the message threads in reverse order
963508 java.util.ConcurrentModificationException: at java.util.HashMap$HashIterator.nextEntry(HashMap.java) at org.mozilla.gecko.NotificationHelper.clearAll
963512 Tabstrip doesn't keep position when in private browsing window.
963516 B2G RIL: provide matchMvno() API for automatic selection of APN relying on mvnoType and matchData
963561 Notify Home.banner consumers when a message is dismissed
963576 Dotted outline doesn't appear in customizable toolbars anymore
963590 [Mac] Toolbar is not being hidden fully in full screen mode more when light weight theme is applied
963592 [b2g] user agent overrides not working correctly
963621 Regression: No video playback (MP4); Samsung Galaxy S4 (Android 4.4.2) (I420ColorConverter)
963639 CustomizeMode _onToolbarVisibilityChange sets @customizing on non-customizable toolbars
963754 Home panels settings dialog crashes with null string
963773 The Toolbutton insertion position should consider amount of scroll of PanelUI
963813 [B2G][Dialer] Initiating conference call while the active call is to an invalid number, causes the dialer app to freeze
963869 Intermittent TEST-UNEXPECTED-FAIL | browser_console_dead_objects.js | Test timed out | leaked window property: foobarzTezt | Found a devtools:webconsole after previous test timed out
963885 Disable mozdevice tests
963925 Find Again is using a previous search query
963962 crash in sse2_composite_src_x888_8888
963974 Faulty crash: use-after-free of mCurrentCompositeTask in CompositorParent::RecvFlushRendering()
963977 Intermittent browser_console_addonsdk_loader_exception.js | Test timed out
963999 Difference between customize-entering and customize-entered states is too drastic
964000 [Holly] Perma orange TEST-UNEXPECTED-FAIL | chrome://mochitests/content/browser/browser/modules/test/browser_UITour.js | Highlight should be shown on a unsecure host when override pref is set
964078 global-buffer-overflow (read) at CJKIdeographicToText
964104 Icon moves when activating toolbar buttons that show panels
964149 tile animation "frozen" in snapped view when swiping
964172 Merge mozmill-tests branches for Firefox 27 release
964244 Items with multi-line labels make panel items jump during customization transition
964251 Better styling for »Exit Customize« button
964257 Location bar briefly shows placeholder text when exiting customization mode
964261 Declare a widget to events created by TabParent::InjectTouchEvent
964262 Fade in icons in customization mode
964267 Pressing the bookmark menu button also depresses the bookmark star icon
964281 Hang when opening log file on http://nightly.mpc-hc.org/
964293 Reading objects from datastore has serious performance and memory consumption problems
964315 The panel menu doesn't have a drop shadow on Windows
964418 Update mochiperf tests to use dom utils frame time recording
964437 Aurora 28 branch still uses NSPR beta, please upgrade to NSPR 4.10.3 RTM tag
964462 B2G FTU crash when accessing e.me privacy page (after opening marketplace privacy page)
964511 Delay snippets initialization until delayed startup.
964585 Regression: Share menu slow to open
964641 Linux64 PGO+non-unified fails to link editline and AsmJSModule
964684 Intermittent TEST-UNEXPECTED-FAIL | browser_webconsole_bug_642108_pruneTest.js | Test timed out
964718 MOZ_CRASH(WidgetQueryContentEvent doesn't support Duplicate()) at ../../dist/include/mozilla/TextEvents.h:333
964873 Linkify COPPA support URL
964997 homescreen is rendered incorrectly when try to scroll more with APZC is enabled
965032 Layout for Sync preferences dialog in signed-out state is messed up
965038 Styling for links
965082 XrayWrapper::{get,set}PrototypeOf is callable for SecurityWrappers
965137 Make session saving more reliable
965209 SDK add-ons placed in panel menu cause styling glitches in sub panels (History, Bookmarks...) on OS X
965237 right padding ignored on text/password fields where values overflow content
965290 Add a exe manifest to the ceh
965324 crash in java.lang.NullPointerException: at org.mozilla.gecko.webapp.Dispatcher.onCreate(Dispatcher.java)
965358 Intermittent testHomeBanner | banner text - correct text appeared in the home banner
965361 Show firefox watermark when you hide all panels in about:home
965362 Intermittent devtools/sourceeditor/test/browser_css_statemachine.js | Exception thrown at chrome://mochitests/content/browser/browser/devtools/sourceeditor/test/browser_css_statemachine.js:95 - SyntaxError: syntax error
965367 Implement "Choose what to sync" check box and dialog for Firefox Account CreateAccount activity
965376 Update final copy for Android Firefox Accounts landing
965381 [B2G][Facebook] Facebook Pages aren't loaded from menu
965455 Opening a link from snippet doesn't set parent tab correctly
965468 LoadStartDetectionRunnable doesn't actually wait for loadstart
965472 Legacy sync link on about:accounts getting started page loads new link in same tab, losing the welcome screen
965498 Bluetooth leaks every blob
965526 Intermittent test_reftests_with_caret.html | Reftest http://mochi.test:8888/tests/layout/base/tests/bug585922.html FAILED
965550 Tab stip doesn't touch scroll if last tab is partially visible
965587 Prevent client from inadvertently submitting two records at the same time
965681 Intermittent TEST-UNEXPECTED-FAIL : xperf: File 'c:\program files\nvidia corporation\3d vision\nvstereoapii.dll' was accessed and we were not expecting it. DiskReadCount: 4, DiskWriteCount: 0, DiskReadBytes: 33792, DiskWriteBytes: 0
965693 Remove annoying "Printing XUL documents is not supported" error dialog
965731 upload a new talos.zip to pick up all the fixes
965745 operation callback not always run when running Ion code, leading to high memory usage
965811 Support Firefox Account-based Sync in Send Tab activity
965822 crash in java.lang.NullPointerException: at org.mozilla.gecko.home.HomeListView$1.onItemClick(HomeListView.java)
965867 Update final URLs for Android Firefox Accounts landing
965896 allow legacy sync reset to expose FxA accounts
965904 Fix array-related rooting hazards in the browser
965914 crash in mozilla::gfx::CopyRect mostly with Intel GPUs
965921 crash in XPC_WN_DoubleWrappedGetter (with AVG toolbar)
965955 Intermittent marStageSuccessPartial.js,marStageSuccessComplete.js | test failed (with xpcshell return code: 0) | NS_ERROR_FAILURE: Component returned failure code: 0x80004005 (NS_ERROR_FAILURE) [nsIProcess.run]
965982 QuotaManager: TransactionThreadPool needs to be shutdown before we shutdown IO thread
966006 heap-use-after-free in libxul.so!nsHostResolver::ConditionallyRefreshRecord()
966014 Show Australis tour page upon update for en-US on Aurora
966020 Enable whatsnew survey page temporarily for Aurora builds with Australis
966021 memcpy buffer overrun when _cairo_truetype_index_to_ucs4 calls _cairo_dwrite_load_truetype_table
966047 Hide home banner when there are no panels enabled
966068 [Linux] UITour: leaves the panel menu open above other applications with focus
966072 [Linux] UITour highlight panel appears below the menu panel
966106 Detect existing accounts during account creation, and offer to sign in
966124 focusing the "Manage" link in Sync preferences produces a weird huge focus outline
966125 [Australis] Ctrl-clicking history item in PanelUI opens url in 2 (duplicate) tabs
966132 [b2g][pdfjs] gaia master fails to open any pdf with TypeError
966136 Permaorange TEST-UNEXPECTED-FAIL | valgrind-test | valgrind found errors | ==502== ERROR SUMMARY: 1 errors from 1 contexts (suppressed: 72 from 66); leak involving PORT_ZAlloc_Util and ctypes and DirectProxyHandler
966140 Intermittent TEST-UNEXPECTED-FAIL | marAppInUseStageSuccessComplete_unix.js | test failed (with xpcshell return code: 0) | exception thrown from do_timeout callback
966143 Crash in org.mozilla.gecko.sqlite.SQLiteBridgeException: Can't step statement: (19) NOT NULL constraint failed: moz_logins.usernameField
966155 Regression: Cmd + left defect in Thunderbird since 2014-01-24
966174 Skip straight back over Get Started when successfully setting up FxA
966213 "Bookmarks Toolbar item" is cut off in menu panel
966241 UITour: Menu panel arrow is on the wrong side when window is maximized
966253 [Session Restore] Shutdown blocker doesn't work
966258 quickmobile.ro loads zoomed in and can not be zoomed out
966282 Scrolling in the Firefox marketplace is significantly worse in Nightly (29) & Aurora (28) than GA (26)
966307 Snippet banner shown over content; overlays over content like an annoying popup
966308 DevTools Themes - Make dark theme the default
966311 Out-of-bounds read in mozilla::WaveReader::DecodeAudioData()
966322 Intermittent WINNT opt /tests/content/media/webaudio/test/test_oscillatorNodeStart.html | Test timed out.
966342 The Sync item in the Tools menu is not responding and misnamed in the unverified state
966348 Rename Promise.cast to Promise.resolve
966384 Promises on workers should use correct busy count.
966434 Update TPS to use FxA
966509 wrong stacking of 3D-transformed elements
966510 [Vivo Meu App] The page covers only half of display
966519 CSS-3d-transformed (perspective) elements missing
966543 Crashes at MacIOSurface::GetDevicePixelWidth() with OMTC
966552 Ctrl+Backspace no longer deletes the previous word in the Gmail compose window
966582 Intermittent test_peerConnection_bug825703.html | application crashed [@ 0x6f430028]
966599 Restore Defaults should collapse non-default-visible toolbars
966606 [Australis] Buttons with long labels overlap in Customize mode
966626 CommandExecuteHandler.exe - Application Error
966630 WebGL crash [@mozilla::gl::GLContext::fCompressedTexImage2D / gleEvaluateTextureImageChange]
966636 Heap-buffer-overflow in mozilla::dom::AudioBufferSourceNodeEngine::CopyFromInputBufferWithResampling
966665 Don't DCE DOM calls that can throw exceptions
966678 Australis' customize mode's "Restore defaults" button disabled styling is broken
966683 Even with menu bar configured to be always-visible, pressing & releasing "alt" now focuses menubar (when it didn't used to)
966698 [Australis] If MenuBar displayed, Mouse pointer does not react at the top pixel In Fullscreen mode(F11)
966727 Toolbar created by sdk/ui should not be customizable
966730 Disabling toggle buttons doesn't work
966741 Middle clicking recently closed tab item in history view keeps panel open
966744 View Selection Source completely broken
966788 Intermittent testAboutPage | GeckoEventExpecter - blockForEvent timeout: Gecko:Ready
966823 browser-fxaccounts.js causes sync to fully initialize too early
966843 Intermittent browser_615394-SSWindowState_events.js | application timed out after 330 seconds with no output
966861 Up/down arrow not displayed for <input type="number"> on Wndows7 Classic visual style
966866 Connected to a site which is run by 'null/null' certificate
966867 Increasing delay in web audio output on systems with native sample rate > 44100
966905 Headers and footer of subviews should be outside scrollable bits of those subviews
966907 Light icon for search box in light theme
966926 Assertion failure: consumer->isConsistentFloat32Use(), at jit/IonAnalysis.cpp:979 or Crash [@ js::LifoAlloc::getOrCreateChunk]
966933 UITour: Add a UI tour link in the Help menu
966970 Intermittent browser_webconsole_bug_632275_getters_document_width.js | Test timed out
966992 Implement overflow-clip-box: content-box
967005 Null-dereference crash if a rejected Promise survives to worker shutdown
967007 Bump the sniffing limit for mp3
967015 Sync datatype selections remembered from previous Firefox desktop user
967016 Snippet banner not scrolling off
967022 Firefox Accounts (Sign In) - Weird spinning animation in the Sign in button (Gingerbread)
967028 history.pushState() and .replaceState() don't invalidate shistory
967032 Intermittent testAdobeFlash | "Process crashed?" on tegra
967033 DevTools Themes - Active arrow for side menus is missing on windows
967047 Excluding FxA credentials from password sync
967049 Remove or augment 'wipe credentials' functionality from passwords sync
967110 Add an inverted help icon and arrow to show on the menu panel anchor when the Help subview is open
967115 Fix SDK toolbarbutton icon styling to not mess with the other buttons
967120 Clean up FxAccounts' public/internal API implementation
967153 Update NSS to NSS 3.16
967168 DevTools Addon icons should not be inverted on light theme
967175 Remove EV entries for ValiCert roots removed in bug 936304
967197 "Create Account" and "Sign In" links in Sync preferences should go to separate pages
967203 Telemetry doesn't save pending pings on shutdown
967218 (Synth APK) - User visible debugging enabled notification shown
967220 If about:customizing is the first tab, the tabstrip looks detached from the nav-bar
967254 Initialize Webapp uninstall listener on DelayedStartup
967299 fix asynchronous test issue in test_ev_certs.js added in bug 962833
967313 FxA-enabled sync doesn't think I'm signed in until I restart
967334 Crash [@ js::BarrieredId::operator jsid]
967341 "ASSERTION: index exceeds allowable range" - nsStandardURL::Host
967342 Server not found pages have '&f=regular' appended to url
967350 browser-fxaccounts openSignInAgainPage() opens wrong page.
967370 Remove duplication in UITour browser chrome tests
967372 Intermittent test_hawk.js | null == 500 - See following stack:
967391 UITour: When opening a sub-view, annotations in the panels initial view should be hidden
967429 input type=number should not throw away unrecognized input on up/down arrow click
967479 New Sync: "Sign in" button in Tools/Options/Sync screen can only be activated via the mouse
967553 crash in throwSqliteException
967572 DevTools Light theme text input border is a bit dark
967587 Keyboard is laggy and keys don't get displayed.
967613 Intermittent browser_apzc.js | uncaught exception - NS_ERROR_UNEXPECTED: Component returned failure code: 0x8000ffff (NS_ERROR_UNEXPECTED) [nsIDOMWindowUtils.sendNativeTouchPoint] | Test timed out
967629 don't release any member nsNSSShutDownObject in any destructorSafeDestroyNSSReference
967634 DevTools Light theme tab bar bottom box shadow / border is a bit heavy
967671 Scrolling start page and then snapping metroFx causes vertical black bar
967674 Port new Fxa sync options work to in-content prefs
967735 WebappManager throws "TypeError: aManifest.orientation.join is not a function" on non-array value
967752 tresize talos regression on January 28th team seen on fx-team
967793 Download notification disappears after a download link opens in a new tab
967836 The titlebar is too short when using an lw-theme on OS X with tabs in titlebar disabled
967907 Change the in-product link to support
967975 Add telemetry for errors that users override cert errors for
967982 Findbar not appearing when Find Again done on non-matching text
968026 Crash in OpenType Sanitiser
968039 UITour: The first highlight is positioned too far right and down
968084 Context menu doesn't appear on list entries in Top Sites section
968095 upload a new talos.zip file
968097 Object.preventExtensions(marquee) crash
968108 Can't switch from Desktop to Metro mode with Firefox 28 beta 1
968129 crash in java.lang.NullPointerException: at org.mozilla.gecko.gfx.GeckoLayerClient.setFirstPaintViewport(GeckoLayerClient.java)
968180 Favicons in URL bar are not fetched after changing an option in settings menu
968200 Intermittent uriloader/exthandler/tests/mochitest/test_unsafeBidiChars.xhtml | application timed out after 330 seconds with no output because we run out of disk space
968251 Added arrow icon of the subview-originating button contains a gradient background
968253 all-locales and friends with wrong content on aurora
968267 Passive updates might not restart properly in metro mode
968316 Highlighter: keep highlight overlay visible while selected node is hovered in markup view
968317 [Holly][Beta] "Relaunch in Windows 8 style Firefox" appears in Firefox menu in non-Metro-enabled builds
968341 Initial sync for clients added to an existing account should not set next sync to 24 hours
968359 Allow the direct verification of CA certificates in insanity::pkix
968384 Bookmarks widget shows "undefined" in overflow panel
968424 Change keyboard shortcut to move selected lines in source editor to Alt-Up/Down
968435 "Now Syncing" doorhanger displays over other applications
968436 Add "1.5" to client records
968439 Sync shows as not set up after logging in
968442 Selected tab gets wrong text-shadow (from tabbox.css)
968447 The Bookmarks Toolbar Items doesn't appear as a normal menu panel button in new windows
968461 Bug 942164 broke building ESR24 with gcc 4.4
968565 URL bar and search container resizer gets removed because of hidden items
968566 Math.fround() Bug
968595 Update OS X Arrow Panel Styling
968622 Moving a Two-Line Icon in the Menu Panel Causes a Scrollbar
968627 Menu Panel Items Do Not Have a Consistent Height
968756 Light theme buttons don't have an "active" state
968762 Plugin overlays are not displayed if plugin element is not fully in scroll view
968774 Metro interface is shown in a desktop window after clicking "Restart" in desktop crash reporter dialog
968814 Frames added in Toolbar have scrollbars if they have any content in them
968828 Sync Icon for the horizontal menu
968838 Crash on australis first-run when right side of window is off screen
968891 Customization Animation Tests - WINNT 5.1 (ix) - 6.57% increase from bug 897496
968924 Add shapes to network status bubbles
968972 Firefox Accounts Button is Compressed in Customize with Overflow
969045 Add feedback item in Settings charm
969080 onCommandHandler is dead code after bug 948213
969125 [Linux] Sync toolbar button disappears during synchronization
969169 Every instance of browserid_identity creates a new DumpAppender
969203 Float32: Take out all Math functions that don't properly commute
969226 Heap-buffer-overflow in read_u32
969227 Handle X-Backoff headers
969303 Add Mozmill test for reopening a recently closed tab via the shortcut (Shift+Accel+T)
969356 When mouse clicking on a top site tile, the watermark shifts
969376 [Australis] Make it easier to hit the menu button (apply Fitts' law)
969382 Assertion failure: isString(),
969417 crash in java.util.ConcurrentModificationException: at java.util.LinkedList$LinkIterator.remove(LinkedList.java)
969421 [Australis] Dragging items really quickly in/between the panel/palette breaks the area layout
969427 recreating a destroyed widget after a CustomizableUI.reset() call causes the new widget to go in the customize palette
969428 Create form data backend library for handling form related actions
969441 crash in JS_TransplantObject(JSContext*, JS::Handle<JSObject*>, JS::Handle<JSObject*>)
969458 Menu Panel Grid Items Have Disabled Subpixel Anti-aliasing
969479 does not fallback from TLS to SSL when using proxy
969483 [B2G][Contacts]User is unable to scroll in the Add Contact menu after opening phone label menu and pressing Done
969492 No progress shown during startup when loading URL from external app
969504 unicode character ▶ is rendered incorrectly with DirectWrite enabled
969511 Don't update snippets cache unless the update timer fired
969528 Sync failure upon FxA authentication displays incorrect UI state
969555 Reduce single device sync interval
969584 Consolidate typography and sizing of panel subview items
969592 Consolidate style of bookmarks panel and its sub-panels
969623 Intermittent testFormHistory | application crashed [@ libc.so + 0x1370d]
969637 Regression: Crash java.lang.NullPointerException in org.mozilla.gecko.GeckoConnectivityReceiver.start(GeckoConnectivityReceiver.java:49)
969656 "Sign in again" menu panel UI should link directly to the sign-in page, rather than preferences
969661 Character Encoding widget stays disabled if you move it to the toolbar from the menu panel while it is disabled
969700 Listen only for top-level DOMTitleChanged in SessionStore.js
969702 Crash [@ PodAssign<char16_t>] or [@ js::CurrentThreadCanAccessRuntime]
969719 Get rid of level="top" workaround for standalone panels introduced by bug 886317
969724 Intermittent browser_webconsole_bug_597136_external_script_errors.js | Timed out while waiting for: external script error message
969728 Standard users cannot update Firefox if Mandatory Profile is used
969756 Heap-buffer-overflow in AppendValueToString
969766 The "Restore Defaults" button doesn't get enabled if a toolbar is shown while in customization mode
969778 Crash [@ js::jit::LiveInterval::addRangeAtHead] or Assertion failure: false (MOZ_ASSUME_UNREACHABLE(unexpected type)), at jit/Lowering.cpp
969780 Australis: All places context menuitems are grayed out after Bookmarks widget moves to a toolbar chevron once
969782 Fennec: "viewFor is undefined" when loading the page-mod module on Firefox 28
969800 Fix nsMemoryReporterManager::GetVsize for !HAVE_VSIZE_AND_RESIDENT_REPORTERS and add GNU/kFreeBSD support to nsMemoryReporterManager
969801 bug 950298 broke make install in js/src
969821 Preferences button tooltip reads "preferences-button.tooltiptext"
969839 Bump required NSPR version to 4.10.3
969853 In customize mode, for "edit-control" and "zoom-controls" tooltip is displayed instead of label in the main panel
969902 Crash in about:memory calling __malloc_usable_size on apparently good data due to bug in DNS memory reporter
969904 Update Bookmarks Star Icons for Consistency
969928 Fix a bug in the de-localization code that can cause validation issues with locales that use '.' as their grouping separator
969929 GeckEditable loses data ... Seen in TextSelection as regression using action bar SelectALL
969932 enable sendfile(2) again in libevent on freebsd
969938 test_ev_certs/generate.py and test_getchains/generate.py generate CA certificates with id-kp-OCSPSigning EKU
969961 CSS vars support is not-on-release, but CSS vars tests don't know that and will be permaorange March 17th
969962 Panel UI footer items are too dark and don't have a box-shadow on pressed state
969963 Grey out PanelUI-popup items when a subview is opened
969965 testUITelemetry will be permaorange when 29 merges to beta on March 17th
969972 browser_styleeditor_autocomplete.js will be permaorange when 29 merges to beta on March 17th
969989 Bug 753203 broke MOZ_APP_NAME handling
970005 Browser hang, when you clicked left upper red "Gmail"
970013 The bookmarks button moves to the overflow after some clicks
970020 Australis: Layout glitch on LocationBar/SearchBar and no longer resize them by mouse dragging
970026 History Footer button should be fixed at the bottom of the subview
970031 xpcom/reflect/xptcall/src/xptcall.o: undefined reference to `nsXPTCStubBase::Stub242()' on sparc64
970054 Regression in text SelectionHandler ... selection closes but leaves dangling handles
970076 crash in libmm-color-convertor.so@0x66e
970081 crash in android.content.res.Resources$NotFoundException: Resource is not a Drawable (color or path): TypedValue{t=0x1/d=0x7f0c0061 a=3 r=0x7f0c0061} at android.content.res.Resources.loadDrawable(Resources.java)
970096 crash in mozilla::gl::GLContextProviderEGL::CreateForWindow(nsIWidget*) - mostly on Sony ICS devices
970112 Geolocation no longer working in Nightly
970123 PGO ts_paint regression on Win XP (1.5%) and Win 8 (3%) by removing the delayload option from the ICU libs
970147 Crash due to fatal assert in WASAPI: handle_channel_layout asserts with "Format not supported, and no suggestion from WASAPI."
970167 disable password sync when master password is enabled
970172 VariablesView doesn't correctly handle clicking while input is active
970209 webapp update logic in about:apps should be #ifdef MOZ_ANDROID_SYNTHAPKS
970213 replace "Check for Updates" placeholder icon with appropriate icon
970257 Input type "number" has width of 0px when set to auto
970294 Perspective + Box-shadow leads to incorrect box size model when transform-ing
970300 (Synth APK) - Checking webapps for updates always downloads the webapp even if there is no update available
970321 UITour: Menu panel broken if tour tab is opened in new window
970358 Disable BackgroundHangMonitor on release/beta
970362 crash in fs_ccf_ni_umh32.dll@0x1ac00
970372 Synced folders never appear until after browser restart
970380 SDK buttons still look broken inside the menu
970382 About:accounts shows generic favicon in address bar instead of browser identity block
970404 browser.display.use_document_colors;false makes start and end of the active tab colored with browser.display.background_color
970483 crash in gfxDWriteFont::ComputeMetrics(gfxFont::AntialiasOption)
970485 `CustomizableUI.getWidget(id).forWindow(window).anchor` sometimes raise an exception.
970511 Allow users to undo the "restore default" action
970512 Remove uninteresting cases for certificate usage verification
970710 "ASSERTION: Invalid offset" in gfxSkipChars with MathML, LRO
970719 Animate progress bar to end of the screen
970769 MenuBar flickers when I click History/Tools menu in the first time
970788 UITour: [Linux] Visual panel bugs when highlighting targets due to incorrect panel size
970810 Modify name constraints tests to test insanity::pkix
970884 Intermittent browser_webconsole_bug_589162_css_filter.js | Timed out while waiting for: css error displayed
970897 The History panel is too small
970914 The Web Console logging API (console.log, console.info, console.warn, console.error) has been disabled by a script on this page
970990 Remove the watermark image because background-attachment: fixed doesn't work with apzc
971034 Australis - [Windows] Zoom reset button isn't as tall as other zoom buttons in toolbar
971108 UI Tour: Update the doorhanger menu style
971116 UI Tour: Implement new UI highlight effect
971120 The help subview make the menu panel shrink
971124 Use an ::after element to workaround for backgound-attachment: fixed making start page watermark jittery
971171 Measure with telemetry how many times people see about:newtab
971177 Can't re-open Style Editor for an app
971178 Expand tests of core certificate verification logic to test insanity::pkix
971246 Fix styling of type="menu" buttons in the menu panel
971257 Reset causes 'want more tools' to show up in Australis palette
971258 Sync email should not be bold in the Australis menu
971276 Hitting enter should insert the currently selected item from an autocomplete list in the Style Editor
971283 Preferences links to Terms of Service and Privacy Notice are too high and and too large
971285 Intermittent smil/anim-path-d-01.svg | image comparison (==), max difference: 1, number of differing pixels: 1
971341 Loading the billing page of Amazon creates infinite amount of tabs
971344 mixed case email authenticates but causes sync to fail
971418 DevTools dark theme: use higher contrast text for main body content
971426 Unable to compile js shells on Windows
971626 Restore Defaults should collapse Title Bar
971630 Australis: Far right/left selected overflow tabs look bad on session restore.
971655 Containing box of <fieldset> with <legend> for absolute positioning has the "bottom:0" point below the bottom of the <fieldset>
971680 Top padding in customization mode is one pixel larger than in normal mode
971693 No audio in mono html5 audio on Audio drivers with vendor enhancements.
971697 Let the frameLoader take care of creating nsISHistory
971705 Fix Australis' panel's mainViewObserver to be disconnected on popuphidden
971713 Device name field in Preferences should be inline
971720 CSS attributes overflow:hidden and border-radius break HTML5 video rendering
971735 java.util.ConcurrentModificationException: at java.util.ArrayList$ArrayListIterator.next(ArrayList.java) in removeHistoricalRecordsForPackage()
971745 java.lang.IndexOutOfBoundsException: at java.util.LinkedList.get(LinkedList.java) in moveToParentFolder()
971765 Reorder Sync datatype options to match marketing
971778 Unbox the Sync datatype selections in Preferences
971825 "Undo" link after restoring defaults should be a button
971933 overflow: hidden on fieldsets spills over
971948 Bookmark toolbar items icon is broken in the palette
971955 [B2G][General]Email address overlaps icon when signing into persona
971956 Bookmark toolbar items uses the old hover styling in overflow panel
972051 Dismiss "Tap to sign in" notification when a sync succeeds
972061 Update style of Sync intro and manage pages
972070 FxAccounts.jsm doesn't drop all state when a new user logs in
972090 webapprt's appstrings.properties file is missing a bunch of strings
972097 Cannot view video from Firefox 28 on opentok
972129 Requesting "sync now" while identity manager is still initializing doesn't sync when it becomes ready
972140 Australis pinned tabs break toolbar interface at small window sizes
972144 Requesting "sync now" while identity manager is still initializing causes error notification to appear.
972243 time for nsISessionStore.getBrowserState() doubled between 27 and 30
972267 Australis: StarUI not responding after toggle position
972286 Australis: "<" mark appears for StarUI in PanelUI without subview
972359 Panels/subviews always have a scrollbar
972364 Crash [@ js::shadow::Object::numFixedSlots] with TypedObject
972405 Bookmarks panel items should be aligned on the left
972478 Disabling script on a docshell should not affect chrome pages
972485 Find out why we're doing a bunch of synchronous file reading at the start of the customize mode transition
972525 Some arrow panels on Windows don't have enough padding
972550 Sync promo footer in bookmarks panel overflows panel content
972566 Panels aren't correctly anchored after resizing the anchor's window
972582 jwcrypto: base64UrlEncoding/Decoding can alter assertion audience
972613 In-memory sync rate limiting
972620 WebGL glHint doesn't MakeCurrent
972622 WebGL.compressedTex(Sub)Image2D doesn't call MakeCurrent
972684 browser_findbar.js | uncaught exception - NotFoundError: The operation failed because the requested database object could not be found. For example, an object store did not exist but was being opened. at chrome://browser/content/abouthome/aboutHome.js:252
972822 Tab groups button presence not persisted correctly when added in Australis
972844 Provide an easy way to dismiss about:feedback for good
972855 [ms] Add Malay to shipped-locales in Aurora and Beta
972856 Timestamp of last happened CC has changed from milliseconds to microseconds in GC API
972879 crash in java.lang.NoSuchMethodError: android.widget.RelativeLayout.setSystemUiVisibility at org.mozilla.gecko.GeckoApp$32.run(GeckoApp.java)
973153 Clicking "Restore Defaults" before the icons load in the Customize window causes it to break until you restart
973217 Australis: sometimes bookmarks sidebar opens with bookmarks menu
973235 Intermittent test_mediarecorder_getencodeddata.html | should get onError first
973264 crash in atidxx32.dll@0x3f884a, video hardware google doodle crash
973268 Return more specific error messages when reasonable in insanity::pkix
973296 vm/ForkJoin.cpp:1318:9: error: use of undeclared identifier 'CALL_GENERATED_CODE' (--disable-yarr-jit)
973338 sync.dtd: add a localization comment explaining concatenation for signedInUnverified before/after label
973344 crash in nsTextEditorState::SetValue(nsAString_internal const&, bool, bool)
973502 Constrain width of the bookmarks panel similarly to the history panel
973694 [OSX] Private browsing windows without tabsintitlebar show the indicator in the wrong place and don't have the right theme
973704 Australis: disabled="false" buttons don't get appropriate hover/active styles
973849 clearTimeout / clearInterval now throw when called without arguments
973855 [Australis] Bottom border of content area in customization mode misplaced or missing
973905 window.setTimeout/setInterval string as parameter 1 no longer works if caller also tries to pass function arguments to the nonexistent function
973931 [OS.File] makeDir should not fail if the directory is a root in the format "D:"
973932 [Australis] 'Restore defaults' button is enabled after every browser restart
974086 [australis-measuring] UITour.seenPageIDs should persist across sessions
974100 Don't expose SettingsService in non b2g builds
974124 Change: borders, padding, and colors
974129 Change: replace cloud and Firefox icons in Getting Started
974134 Improved layout for Status activity
974175 Consider not using grouping separator characters when displaying <input type=number>'s value
974179 Backout patch to hide menus in editing mode
974195 Use Accounts.jsm for sync promo banner
974229 Remove obsolete star-button element
974258 History shown in Location Bar is no longer constrained by urlbar width when using the drop-down arrow
974378 [Gingerbread] [WebRTC] Audio Input / getUserMedia is broken on Gingerbread
974406 Successfully bookmarking Twitter does not change the bookmark star icon's state
974413 Notification prompts result in empty lower margin in content
974430 Put the |input[type=number]| rule in forms.css into a separate sheet so we can make it respect to the dom.forms.number pref
974481 Quickly Exiting Customize Mode after Restoring Defaults Makes Customize Sticky/Broken
974496 Enable sync promo banner
974537 Echo cancellation is much worse than chrome on apprtc.appspot.com
974723 Send shown event when a banner message is displayed
974751 Crash [@ ArgGetter] or [@ js::Shape::get] or Assertion failure: hasScript(), at jsfun.h
974804 Calling recreatePopup on the menu panel before it's ready leads to a computed width of 0 for the panel scroller
974819 Tab overflow arrows always visible in private browsing
974825 Firefox hangs on a specific PNG image
974830 Expose MOZ_APP_DISPLAYNAME in application.ini if it differs from MOZ_APP_BASENAME
974892 [ms] Test failure "Suggestions from two search engines are available - '0' should equal '2' " in /testSearch/testSearchSuggestions.js
974902 [ms] CTRL+a opens page souce instead of selecting all content
975052 The global object in workers is not rooted properly
975111 No option to Relaunch in Metro mode from old-style menubar
975167 Traceback in autocompletion while debugging
975173 HomeBanner CalledFromWrongThreadException
975239 Home banner will only show one message per app lifetime (the one that was added first)
975372 Australis undoReset state broken in automated test (which still passes) | gSavedState is null
975387 TextComposition should clear mPresContext when the PresContext is destroyed
975423 Don't show sync promo banner ever again after user hits close button
975460 Crashes in libCGXType.A.dylib@0x111d | MacFontInfo::LoadFontFamilyData(nsAString_internal const&) on startup on OS X 10.6
975468 <input type="color"> , Mac OS X: when picking color for one <input>, if you click on a different <input>, the first one clones its color
975469 Sync promo banner does not hide on Sync sign-in
975528 Searches using Bing are missing codes for search bar, about:home, and context menu
975552 Preload about:customizing like we do with about:newtab
975570 Measure with telemetry how many times people interact with about:newtab
975695 "Assertion failure: !NS_HasPendingEvents(currentThread)" with many SharedWorkers
975719 Custom toolbars added pre-Australis can't be modified or permanently removed after upgrading to Australis
975773 Hit MOZ_CRASH(this shouldn't be called for filters without inputs) [@ mozilla::gfx::SourceNeededRegionForPrimitive]
975794 Toolbarbuttons in the menu panel shouldn't get an inverted dropmarker when using a dark LWT
975807 The separator between 'Bookmark this site' and 'Bookmark menu' should be placed at the same place as the right-side border of the hovered 'Bookmark this site' button
975808 When hovering over disabled 'Bookmark this site' button the 'Bookmark menu' button gets hovering state set
975894 sync preferences should listen for weave:service:start-over:finish instead of weave:service:start-over
975935 rowlines/columnlines broken in Gecko 29+
976108 The properties positions are moved to the left in the Manifest Editor
976115 Higher latency on WebRTC DataChannels than Chrome
976175 Banner appears on top of non-about:home page during session restore on 2.3
976176 On Android 2.3 home banner will remain visible even when visibility set to GONE
976181 startup crash in nsContentUtils::IsCallerChrome()
976232 Banner shown in Guest Browsing
976369 Firefox does not fetch additional segments of dzone web page
976393 Better logging of token server errors
976426 Progress bar stuck on neterror page
976489 Move the customize mode transition to the #navigator-toolbox
976513 Intermittent | browser_panel_toggle.js | Check that panel has panelopen attribute - Got , expected true
976536 Firefox 30.0a1 Crash Report [@ js::jit::InlineFrameIteratorMaybeGC<int>::findNextFrame()
976633 Clicking Cancel on merge warning should not initiate Firefox Account creation
976654 frame should take `name` instead of `id`.
976680 Promo banner on tablets in squished occasionally on rotation
976738 Devtools Themes - Switch back to light theme
976739 <input type="number">: required attribute breaks up/down arrows
976769 After closing the placeholder, the plugin-area is still covered by the gray area, blocking other elements
976792 CustomizableUI's insertNodeInWindow should go through placements and try followup next nodes
976849 Add-on errors, missing navbar buttons, start page doesn't work after switching from desktop
976905 tooltip for "Show your bookmarks" button has too much padding
976920 Back out bug 932322 on beta until we're sure the spec will stay as it is
977029 When changing the value of <input type="color">, its default value is also changed
977150 Position of PanelUI-popup is hard coded
977155 Home banner can appear on non-default panel if panels swiped before gecko is running
977217 Clicking API-widget borders in the menu panel does nothing
977226 preventDefault() does not prevent the mouse events
977310 ASSERTION: Should have sanitized
977336 Support action bar "up" for FxAccountStatusActivity
977502 Sync will never retry if initial authentication fails.
977516 Fog behind tabs doesn't appear in customization mode anymore
977538 MSVC with PGO still miscompiles/nops CanonicalizeNaN
977543 CTP overlay is not displayed for iframes/embedded videos
977554 Error in parsing value for 'animation-timing-function'. Declaration dropped. browser.css:345
977572 Drop indicator of new Bookmarks Widget stays forever
977643 Now that android has a colorpicker, it shouldn't have a special pref("dom.forms.color", true) line in its prefs file
977668 Firefox hangs on Facebook text entry when inline lookups pop up
977796 Disable subpixel anti-aliasing during customize mode transition.
977844 Make sure snippets response is valid JSON before caching it (or trying to use it)
977862 Customization mode outline doesn't appear on drag for empty toolbars
977931 hawkclient fails to throw the correct error when no response headers.
977955 PluginModuleParent may delete its subprocess before calling MessageChannel::Clear, resulting in badness
978001 make nsViewManager::ProcessPendingUpdatesForView look at the local view manager instead of always the root one
978003 Update inContentUI.css for Windows 8 and up
978048 Customization mode outlines don't appear when moving the mouse over an empty space
978050 Use a bright color for the outline of the tab strip in customization mode with certain themes
978068 attribute [fastcustomizeanimation] set on #content-deck, but CSS targets #tab-view-deck
978072 update mozilla domain for social activations
978084 Attribute [customizing-movingItem] set but not removed.
978127 Update various win8 specific australis customized ui tests to use new Services.metro.supported prop
978131 [Australis] Legacy toolbar button labels misaligned in menu panel
978177 ASSERTION: nsTDependentString must wrap only null-terminated strings, in InterposeNtCreateFile() (via VideoCaptureDS::SetCameraOutput() / CreatePin())
978251 "target is null" when clicking on contents of panel
978309 Don't show white arrows on bookmarks panel folders when active on Linux & Windows
978447 Australis - Bookmarks widget submenu menu item doesn't have an active state
978509 Fix the remaining Ts regression from bug 970123
978647 Firefox freezes and RAM consumption reaches 2-3 GB
978731 Cursor position jumps around, dragging handles moves text
978741 History tab is highlighted while Top sites tab is displayed
978752 Tab strip gradient is broken in customization mode on Windows XP in classic mode
978759 crash in mozilla::net::Seer::MaybeScheduleCleanup()
978767 Hovering over the zoom controls and cut/copy/paste in the menu on Linux makes the panel layout jump
978836 switch to production APK Factory servers
978876 Support declined engines in meta/global on desktop
979031 Don't animate the tabs when adding about:customizing
979034 Make CustomizationTabPreloader kick-off when the user opens the menu panel.
979053 Fade in the placeholder and customization target outlines after entering customize mode
979054 Try adding toolbar edge padding before customization transition starts, not after.
979078 SHA-256 license distribution with binary
979232 Bookmarking animation goes the wrong way in RTL mode
979260 [ms] Add Malay to Fennec all-locales
979300 Main menubutton separator is on the wrong side in rtl mode
979378 [Australis] Update Panel Checkbox
979388 mobile/android/base/AndroidManifest.xml.in make deps are incorrect
979405 bing pc and form codes are incorrect
979456 Australis: Extra padding exists at the left edge of the Bookmarks toolbar
979477 Increased vertical spacing in australis menu makes it too tall
979499 Panel Subview anchor arrow is invisible on RTL (and if we made it visible, it'd point the wrong way)
979501 Australis' navbar overflow chevron points the wrong way in RTL mode
979587 Australis: sometimes bookmarks sidebar opens with bookmarks menu
979599 Show Australis tour page upon update for en-US on Beta
979653 Ctrl+Shift+X does not work in URL bar in RTL locales
979747 Australis: should use inverted text for zoom widget and bookmark items in the tabstrip and menubar on Windows Classic
979871 Bookmarks button in the menu panel need to be moved up a little
979938 Tab close button flickers when opening a new tab
979951 Worker Runnables can end up running and creating objects in the SafeJSContext global
979953 Tab titles shouldn't be bold on OS X
979987 Subviews footers text isn't centered anymore
979993 Small leak in HTMLInputElement::SetValueInternal
980052 Crash in mozilla::MediaStreamGraphImpl::RunThread() while receiving calls and sms
980067 ARM: not flushing icache correctly when coalescing ranges in different vmas
980115 Social API status buttons make many other toolbar-buttons vertically squished
980130 Bookmarks menu button breaks after reset if it used to be in the panel
980155 Initialization of overflowable toolbars breaks when adding them dynamically
980182 Add tests for about:accounts?action=
980220 UITour: [Linux] highlighting panel with transparency renders badly with Awesome, fvwm, and other WMs without X compositors
980243 Wrong display of OpenLayers GIS maps
980339 about:addons squaring
980369 Update the illustration in the Customize Tip section
980370 Downloads button changes size when clicking it in the nav-bar
980374 Adjust height of buttons in the nav-bar to match the height of urlbar and search box
980383 Add border-top and border-right values to the "Exit Customize Mode" button
980413 about:permissions squaring
980433 Multiple talos regressions after landing bug 870593
980445 Bookmarks menu button hover/pressed state issues
980471 Progress bar on the Nexus 7 is not fully rendered or visible
980478 Sync fails to get token - invalid timestamp issues (TokenServerInvalidCredentialsException)
980534 Australis: Bookmarks Widget panel is too narrow for contents (causing horizontal overflow), which shift to the left when mousing over it the first time
980537 mozJSComponentLoader::mThisObjects is not properly rooted
980569 Bookmark star animation is misaligned after fixing bug 975807
980839 Panel UI doesn't prompt for reauth when restarting after password change
980853 Two progress bars are displayed on some tablets
980876 crash in mozilla::dom::GamepadService::NewAxisMoveEvent(unsigned int, unsigned int, double)
980879 [Australis] Navigation buttons in urlbar overlapping search bar when resizing a window when on verified identity site
980907 [ml, mr, kn, mai, ta, te, bn-IN, gu-IN, as, or] Add Indic locales to Fennec all-locales
981062 ~6% cart regression on Win 8 found on fx-team from march 7th.
981140 Add identity.fxaccounts.remote.signup.uri pref for the FxA signup URL
981166 Disable Metro builds
981172 When browserid_identity.js encounters an AuthenticationError it should fire a "weave:service:login:error" notification
981280 WebVTT / HTML5 track support too buggy to switch it on
981305 [Australis] Developer widget - Don't copy over <menuseparator> if previous item is the first item and a <menu> element
981325 Differential Testing: Different output message involving Math.fround
981418 CustomizableUI type:view and type:button widgets need an onBeforeCreated handler
981419 [OSX] Toolbar checkmarks in toolbar context menu are cut off and unrecognizable
981447 dns cache too sticky!
981513 dns cache grace period error busting too aggressive
981520 Test failure 'Edit Bookmarks Panel has been opened' in testBookmarks_AddAndRemoveBookmarkViaAwesomeBar/test1.js
981522 Revert bug 942804 in Aurora
981548 Bookmark star animation disables click on bookmarks widget during transition
981614 crash in java.lang.NullPointerException: at org.mozilla.gecko.home.HomePager.onToolbarFocusChange(HomePager.java)
981680 audio/video sync busted in webrtc.org upstream 3.41 update
981681 startup crash in XREMain::XRE_main(int, char** const, nsXREAppData const*)
981700 Australis, toolbarbutton type="checkbox" doesn't have a visible checked state.
981827 Make Android and Desktop FxAccounts client use same key parameters
981931 Leak of realP and imagP in PeriodicWave::createBandLimitedTables
981941 don't show the password autocomplete popup for about:accounts
981947 Use PeekMessage() instead of GetMessage() when we try removing found message with PeekMessage(PM_NOREMOVE)
981951 We should remove following char message immediately after we find it at handling keydown message
981954 Sometimes we remove a char message whose scan code is different from found message
981957 Make browserid_identity's log consistent with other sync logs
981958 PeekMessage() sometimes fails (returns false) at removing found char message on MetroFirefox
981960 PeekMessage(PM_REMOVE) sometimes fails to remove found char message (returns false) even if the message still in the queue
981963 PeekMessage() may remove char message which is really different from found message (wParam of WM_DEADCHAR becomes 0)
982022 Page helper application icon is no longer displayed in the URL bar (Aurora 29.0)
982027 Moving an icon around removes custom context menu
982181 Tapping on History panel buttons interact with banner (Android 2.3)
982182 Check for Updates in about:apps fails to check for updates
982183 [webvtt] Put VTTRegion implementation behind a pref.
982241 signing in again after changing password doesn't update menu panel UI
982398 GIRP game crashes in EnterBaseline
982448 some fxmetro pref's still being left behind with values without --enable-metro in the mozconfig
982478 updating from fxmetro will produce "Class not registered" error prompt
982557 updating Fennec to a version with Synthetic APKs triggers app updates that hang on launch
982559 updating to Synthetic APKs and tapping Home screen icon for previously-installed webapp crashes Fennec
982615 Sync panel is not entirely displayed in localized builds
982620 UITour: menu button remains in active state after aborting tour
982684 SDK toolbar notification dispatch code uses .wrappedJSObject, which means callees can't trust the argument
982770 Sidebar border and header styling are broken on Windows 8
982835 [OSX] Bookmark item hover background color is wrong when subview opened in Panel UI
982848 Don't clear syncKeyBundle in BrowserID Identity manager during failures to fetch token
982885 'Check for Updates' link is missing on Aurora 29.0a2
982906 privilege content loading (ZDI-CAN-2214)
982909 popup blocker bypass (ZDI-CAN-2215)
982957 OOM in TypeObject::sweep leaves pointers dangling (VUPEN Pwn2Own) (ZDI-CAN-2219)
982974 TypedArrayObject.cpp doesn't take into account that ArrayBuffers can be neutered (ZDI-CAN-2220)
982993 Arrow panels don't have enough padding.
983211 crash in @0x40098bd4 corrupt crash stack on x86 tablets Galaxy Tab 3 10.1
983256 Change the client generated expiration time in FxA assertions to be "forever"
983270 Error notification indicating bad password disappears as scheduled sync starts and fails
983344 ZDI-CAN-2225 vmtypedarrayobject.cpp dst ptr is checked the length is not checked
983350 Send explicit user agent for FxA and token server requests
983448 masm.convertUInt32ToFloat32 gives wrong results on x86
983571 browser.bookmarks.autoExportHTML = true no longer works on 29.0a2 as of 03-13-2014
983583 [Australis] Customizable items labels sometimes wrap following hyphenation rules of different language if language packs installed
983632 [Australis, Windows HiDPI] button icons can be completely hidden but still be on toolbar and not in overflow menu if window resized/width decreased
983638 Create an aurora/beta-plausible workaround for the fog part of bug 940455
983653 UITour: Make the highlight effect a circle on the bookmarks combo button
983655 Star icon is not aligned in the overflowed panel
983690 Australis: Zoom widget %label is missing in toolbar
983699 View widgets in overflow panel show panel anchored on themselves instead of chevron
983709 Wrong results if JIT is enabled
983723 Yahoo search tags are not working properly
983732 Sync promo footer in bookmarks panel margins are too much
983761 tab-active-middle@2x.png should be used with lightweight themes
983768 Australis: Zoom %label is not center in over flowed panel
983770 Australis: Unexpected scroll bar appears when zoom widget is in overflowed panel
983801 Australis - Remove border-radius on the bookmarks panel submenus on Windows 8
983913 Some assertions in test_browserid_identity aren't effective
983997 Clicking StarUI does not pop up "Edit Bookmark Panel" when almost finishing of the animation "Bookmarking animation"
984156 Australis: Mouse wheel scroll no longer works in bookmarks sub folder
984170 Bookmarks have incorrect text colour on lightweight themes
984188 Overflow panel icons are inverted with -moz-lwtheme-brighttext while text isn't
984308 Uncheck 'cookies' in clearFormHistory.js to avoid the Flash Crash
984317 Lightweight themes leave a sliver of the "back" button uncolored, with Australis and keyhole-style button on Linux
984447 Hangs in fork() with Java plugin which spawn hungry zombie processes, caused by bug in jemalloc
984455 Opening unsorted bookmarks or bookmarks toolbar folders in the bookmarks menu button, resizing the button into overflow menu, and resizing it out again, disables context menu on those folders
984530 Bing search tags are not working properly
984535 different padding on buttons when social buttons enabled
984628 share button no longer works
984630 socialapi buttons have no hover state, incorrect padding, etc on linux
984723 Further tweaks to sync scheduling
984796 SVG path getTotalLength returns large incorrect number
984804 Open All in Tabs not highlighted on keyboard selection; weak change on mouse-over
984873 After tapping a home banner, delay showing another one
984976 Australis - toolbar button type="menu-button" border behaviour is weird on Windows 8
984979 Australis - Back button's open state doesn't match :active state on Windows 8
985145 Error bar displayed during Sync 1.5 node re-assignment
985172 When the bookmark button is in the overflow menu the label doesn't toggle between "Bookmark this page" and "Edit this bookmark".
985184 WebappsUpdateTimer.js not packaged with Fennec
985186 Unwanted white space for multiple of 10,000 in Korean counter styles
985195 WebappsUpdateTimer shares timer ID with nsUpdateService
985212 Old sync sometimes disconnects by itself after updating to Firefox 29
985228 Intermittent browser_codemirror.js | application terminated with exit code 3221225477 | application crashed [@ InitFromBailout]
985267 Australis menu bar hard to read on Windows 7 dark third-party themes
985274 [meta] Solve Unexpected callback with message = 'undefined' bugs in WebRTC tests
985416 Toolbar type="menu-button" Open State isn't correct
985463 onclick opens 2 times the same link
985618 WebappManager tries to cancel undefined notification on automatic update check
985777 Unable to exit customize if normal and private customize windows are open
985786 [10.6] The fullscreen button's icon is missing while in fullscreen
985815 Show/hide toolbar does not propagate to all open windows and won't enable restore defaults for private windows
985859 navigator.mimeTypes has lower-cased MIME types since Firefox 28 while preserving case on earlier versions
985922 Firefox 27.0.1 startup crash in memcpy | fill_window with BitGuard
985958 Bookmarks toolbar open bookmark folder background depends on hover state when it shouldn't
985988 event.defaultPrevented returns different value from other browsers (IE, Chrome)
986146 Firefox 29.0 Crash Report [@ nvwgf2um.dll@0x6fdd1f ]
986324 Text inputs (URL and search bar) are unreadable in the nav-bar in High Contrast Mode
986347 Re-regression, menupopup is transparent, menuitem are invisible in certain case.
986515 Classic menubar gradient shadow leaks over bookmarks toolbar
986529 Invert Tab Close Icon for background tabs on Windows Classic Theme
986542 .onClick event handler function not firing if defined in a document that was in a now-removed iframe
986636 question mark that appears when password sync is disabled due to master password should be an image
986678 Assertion failure: MIR instruction returned value with unexpected type, at jit/IonMacroAssembler.cpp
986762 Intermittent test_dataChannel_basicAudioVideo.html | application crashed [@ mozilla::DataChannelConnection::~DataChannelConnection()]
986769 Australis: Character encoding widget broken since March 21th
986797 [Mac] Top padding is doubled in OSX Lion full screen mode for private browsing window
986843 AutoHoldZone is a hazard with IGC
986864 Crash [@ memmove] or [@ mozilla::PodCopy] or [@ js_NewStringCopyN] or Assertion failure: PointerRangeSize(src, static_cast<const T*>(dst)) >= nelem, at dist/include/mozilla/PodOperations.h
986920 [Windows Classic] New tab button stealing focus from unselected tabs
987003 Arbitrary code execution from web notifications
987076 Construct HTMLMediaElement::mTextTrackManager lazily
987140 ASAN heap-use-after-free in nsGenericHTMLElement::GetWidthHeightForImage
987147 Bug 985212 broken capability of TPS to run via sync authentication
987177 CustomizableUI caches wrappers for XUL widgets too aggressively, doesn't offer option to invalidate
987248 crash in mozilla::net::Seer::WouldRedirect(mozilla::net::Seer::TopLevelInfo const&, __int64, mozilla::net::Seer::UriInfo&)
987294 Unsafe access to mTabsChangedListeners in Tabs
987407 Firefox tour/What's new page did not display after a pave-over upgrade from 28 to 29
987433 Use after free with relList attribute of <a> element
987443 Rounding error of Zoom Widget %label
987461 [Linux] Bookmarks menu button dropmarker looks terrible (stretched vertically) when on bookmarks toolbar
987492 CustomizableUI.jsm should provide convenience APIs around windows
987615 Australis menu is broken in customization mode with long strings and unsupported hyphenation
987792 The bottom part of the letter 'g' is clipped on two-line buttons in the menu panel and one-line labels in the customization palette
987816 verifying with certificateUsageVerifyCA always return failure
987867 JB & KK crash in java.util.ConcurrentModificationException: at java.util.LinkedList$LinkIterator.next(LinkedList.java)
988051 Lazily load FxAccountsClient.jsm
988106 Debugger unwraps window Xrays, then tries to call DOM methods on the result
988144 UITour: Highlight effects don't occur if a highlight is moved to a different target without calling hideHighlight
988156 Netflix appears black in fullscreen (using Silverlight)
988191 Title bar font color shouldn't be as eager to change according to window border color on Windows 8
988305 UITour: getConfiguration("availableTargets") does not always work
988309 Add a nsRenderingContext ctor that takes a Moz2D DrawTarget
988453 application crashed [@ libSystem.B.dylib + 0x4f0b6] called from hnj_hyphen_free
988527 End of progress bar is offset by 1px
988548 crash in graphics driver (mostly Intel, sometimes NVidia) coming from CanvasRenderingContext2D::DrawImage
988853 Disable Metro builds on secondary configs
988862 Flashing black boxes when scrolling on Windows
988863 Location expandos can disappear
988961 crash in InitFromBailout
989009 Australis: Hard to read highlighted label |Open "LiveBookmarks Name"| of LiveBookmarks (Windows7 Classic)
989130 Explicit line-height on <li> makes the list-style-image not affect the spacing between list items
989133 Add a soft hyphen to the character encoding label for en-US to avoid auto-hyphenation
989166 OdinMonkey: Invalid read and write of size 8, possibly in JIT code
989183 Global-buffer-overflow in nsXBLProtoImpl::InstallImplementation
989210 Heap-use-after-free in mozilla::dom::TextTrack::AddCue
989289 Australis: Toolbar seems broken after launch Firefox28 -> Firefox29 -> Firefox28(Icons and Text) -> Firefox29, And "Restore Defaults" does not fix the broken
989294 Synthetic APK never launches if downloaded outside Fx Marketplace
989449 Dropmarker corners do not have border-radius on Windows 7, Vista and XP
989466 urlbar-back-button-clip-path clips the location bar vertically depending on the font size and implied line height
989549 Call signOut() in FxAccountsClient.jsm from signOut() in FxAccounts.jsm
989586 new Array(length) return wrong size
989604 [Australis - OSX] Tabstrip Dropdown Button is too close to the Fullscreen Button
989609 Customize mode can break after bootstrapped add-on with custom toolbar restarts
989683 Menubar text color no longer changes in inactive windows (without tabsintitlebar)
989701 Location bar text sits one pixel too high unless the forward button is enabled
989712 Windows: Bottom border of customization mode is missing outside -moz-windows-compositor
989761 [Windows Classic] Pinned tab separator overlapping nav-bar when in overflow mode
989922 Test failure "Element.waitForElement(): Element 'ID: errorTitleText' has been found" in testSecurity/testSSLDisabledErrorPage.js
989965 Crash in nsCSSRuleProcessor::GetContentState with inIDOMUtils.getCSSStyleRules()
990125 Duplicate reminders to update apps
990202 Intermittent test_framedhistoryframes.html | /tests/docshell/test/test_bug384014.html finished in a non-clean fashion, probably because it didn't call SimpleTest.finish()
990218 Simplify OS X's titlebar handling
990384 Define tabToolbarNavbarOverlap to reduce magic numbers
990387 Toolbar buttons on the TabsToolbar appear below the nav-bar border with a theme
990395 After installing Link Bubble, all web pages get a HelperApp icon
990533 Home button icon looks stretched when placed in the Bookmarks toolbar
990794 heap overflow write from allocation size overflow in AllocateAudioBlock
990834 hawkclient errors and retry/backoff headers not handled correctly
990979 about:welcomeback is missing a CSS file on aero variant of the Windows theme
990988 hover highlighted menu items with a dark background should have light foreground (browser.tabs.drawInTitlebar;false)
991072 Zoom percentage label not aligned properly when placed in a toolbar
991251 Heap-buffer-overflow in mozilla::AudioBlockCopyChannelWithScale triggered with ChannelMergerNode
991400 SVGEllipseElement.cpp instantiates gfxPath (which is refcounted) on the stack
991434 WebGL fur demo is much slower in Beta 29 than Firefox 28
991457 Array lookup gives incorrect boolean results when JIT is enabled
991471 nsStandardURL::SetHost called net_ToLowerCase with a bogus pointer
991736 Disable flash tests for Windows due to crashes
992270 browser_google_behavior.js & browser_bing_behavior.js fails when run in chunks on Cedar
992373 Items in panel jump up slightly when the customization transition finishes
992398 update social.directories pref
992747 "View">"Toolbars">"My toolbar" toggle not working for non-customizable toolbars
992968 AddressSanitizer: heap-buffer-overflow [@ js::jit::CodeGeneratorShared::allocateCache]
993087 Incorrect SVG rendered when using filter and clip path
993190 Remote inspector makes page content disappear
993265 Bug 990533 made livemarks and special folders show the placeholder favicon
993299 Australis - There is no minimum width set in customization mode
993322 CustomizableUI: Toolbar icon disappear if a toolbar is removed
993421 7.59% CART regression when bug 967110 landed
993546 memory reporter wrappers for realloc can use-after-free
993918 imgRequest::Release() hits NS_CycleCollectorSuspect3 MOZ_ASSERT(data) assertion failure during shutdown
993932 TART regression from bug 986324
994335 startup crash in nsXULPrototypeDocument::GetCompilationGlobal()
994344 crash in mozilla::net::Seer::GetDBFileSize()
994456 WebRTC doesn't work in Android WebApps
994758 Rename tabHeight define in browser.inc to tabMinHeight
995065 Backout bug 947227 and fix WebGL hangs
995161 Customize mode can still break after bootstrapped add-on with custom legacy:true toolbar restarts
995266 mochitest-browser leaks SimpleTest methods from previous test run until overriden
995289 Out-of-Bounds Read in mozilla::dom::OscillatorNodeEngine::ComputeCustom
995607 AutoDebugModeInvalidation can discard baseline scripts that are on the stack
995995 browser/base/content/test/general/test_bug364677.html connects to yahoo everytime (browser/components/feeds/test/chrome/test_bug408328.html too)
996009 editor/libeditor/html/tests/browserscope/test_richtext2.html connects to goo.gl everytime
996019 browser/base/content/test/general/browser_bug435325.js connects to example.com 93.184.216.119
996031 crashtest layout/generic/crashtests/455407.html connects to mozilla.org everytime
996148 The PB indicator in full screen mode seems to be cut off
996159 Sync panel is still not entirely displayed in some localized builds
996186 Main window briefly shows flat background color during customize mode transition
996372 selecting a click event to monitor, then clicking in the page crashes Aurora 30 and Beta 29
996883 Crash [@ js::jit::Simulator::decodeType2]
996960 Add new RTL languages to locales.nsi - Uyghur ug and Urdu ur
997179 Bing search is not present in the default search engines
997402 both bing and yahoo params are broken
997625 Sync panel: Checkbox for syncing passwords enabled (not disabled) while sync credentials need reauth
998370 gethash completions broken in Beta
999080 Add-ons manager hidden tabs are always displayed
1001167 Session Restore doesn't handle a corrupted sessionstore.js file properly
1002394 Test failure "Add-ons Manager has been opened" across addons tests
1003707 pdf.js print prints a white page
1003897 Character Encoding selection broken in Fennec 29
1005035 Increase 'security.dialog_enable_delay' to work around JSBridge disconnect issue
1005074 Re-enable 'Send Tab to Devices' on Beta and Release with a string swap
1005942 Investigate Undo Close Tab not working in 29
1005958 Disable seer until new backend is rewritten

1911 Total; 1911 Open (100%); 0 Resolved (0%); 0 Verified (0%);


Unresolved

Full Query
ID Summary
492960 It flickers when I move a mouse on an disabled context menuitem of pull down Bookmarks menu with Windows Classic Theme
527676 Bottom border of SELECT pull down is not drawn in windows without HWA
668583 crash @ js::gc::ScanRope
680365 Content of m.youtube.com, mobile.twitter.com is not displayed if "Allow Cookies" is set to "No" - window.sessionStorage can be read but not used
683681 -moz-linear-gradient background image repeats if page height exceeds browser gradient with HWA off
737658 Fennec should raise the same key down/press/up event sequence for input forms, regardless of device type or OS version
761219 Reposition custom menu drop-down on rotation
775400 external links sent to firefox cause loss of focus when browser.tabs.loadDivertedInBackground = true
782063 lcamtuf's canvas fuzzer hangs Firefox
784615 View jumps to the top of the page when the search string does not match any word on the page
787879 crash in js::SweepBackgroundThings
790245 Pinch-zoom is still enabled after the Context Menu is triggered if the touch was not released
791112 Crash due to fatal assert in winmm: cubeb_refill_stream/winmm_refill_stream
795767 There is no way to see and/or undo any certificate error overrides in Firefox for Android
798274 crash in gfxContext::PushGroupAndCopyBackground with Direct2D 1.1 (d3d11.dll 6.2)
812118 Reader Mode toolbar is displayed in the center of the tab thumbnail in landscape mode
812186 crash in js::InvokeKernel @ UserCallWinProcCheckWow with Norton Confidential 2013
817396 crash in PRMJ_Now
818604 Assertion failure: !entered && i < mLength, at ./dist/include/js/Vector.h:346 or Invalid read [@ JSC::Yarr::YarrPatternConstructor::containsCapturingTerms]
822979 Duplicate bookmark should be announced by a pop-up
835515 Nightly becomes unresponsive when importing months of history from Chrome
844795 Tab outline looks fuzzy on HiDPI displays w/layout.css.devPixelsPerPx = -1.0
846315 Firefox consumes high CPU with background-size: cover
857120 Display issue when changing the orientation of device in Awesomescreen
858483 The Password Doorhanger is misplaced if the url bar is hidden when signing in
859204 PDF.js display of file is missing most text
866599 Failure 'Disconnect Error: Application unexpectedly closed' in /testPreferences/testPasswordSavedAndDeleted
869543 Move findbar to the top
870077 pdf.js Character does not display
871327 "math on NS_UNCONSTRAINEDSIZE" with columns and font-inflation
874863 Get reverse direction button is not working in google maps
874950 Opaque content can incorrectly occlude content that has a displayport set
875351 Get direction not working on google maps requested desktop site
875562 Write a log of crashes for FHR consumption
878023 [OS X] Seam of background-images sometimes visible on hovered background tabs
881876 [TABLET] Incorrect image opened on Google images
886432 Text in Nightly search engine field renders differently depending on amount of text entered
887252 [TABLET] about:firefox page is zoomed in after performing specific scenario
887402 Add a 'super-toast' for 'Bookmark Link' context menu item
888567 Bookmark star icon doesn't work properly on link-opened tab
891364 GCLI inspect command and Inspector's selectors search do not consider iframes
892990 Intermittent Win7/Win8 reftest-no-accel content/canvas/test/reftest/webgl-clear-test.html?__&_____&________ | application timed out after 330 seconds with no output
895223 Can't JSON stringify a proxy to an array
897870 crash in mozilla::Logger::~Logger with abort message: "file e:/builds/.../ipc/chromium/src/base/pickle.cc, line 136" (Pickle::Pickle)
900592 Flash video playback not fitting the designated video box
903842 crash in mozilla::layers::LayerManagerD3D10::VerifyBufferSize @ CDXGISwapChain::ResizeBuffers
904673 Canceling master password request when accessing saved password opens password window
906405 SVG marker causes rendering to stop
908534 Opening one of the "about" pages in a new tab does not use the correct identity block
909589 image.animation_mode=once does not work sometimes
910729 Pressing the Apostrophe in a content editable opens up the quick find dialog
911152 The Dissolve website can not be scrolled
917050 valgrind - Invalid read of size 1 in js::jit::CompactBufferReader::readByte()
918799 [TABLET] Pinned bookmarks are truncated
920408 Incorrect transitions between the search magnifying glass and the go arrow
920503 [Table] The "Customize" Settings menu option is not highlighted when entering the settings menu
920930 "Switch to tab" loads the page in the current tab from Reading List
921730 "This plugin is disabled" placeholder cannot be closed
922595 Signed integer overflows in WebRTC audio_coding/audio_processing
924839 Update in-tree ICU to 52.1 (possibly with a few local patches)
924934 Mixed Content Blocking shield icon is not displayed on some devices
926292 Mac-scrollbar is behind z-index: 1
927377 Huge CPU use on http://frozenbyte.com/ with image high-quality downscaling enabled
928168 [10.9] Crashes @ libsystem_kernel.dylib@0x15866 | js::ctypes::FunctionType::Call
928309 Intermittent test_bug467672-2a.html,test_bug467672-3f.html,test_bug467672-5d.html,test_bug467672-2c.html,test_bug467672-5b.html,test_bug467672-4g.html,test_bug467672-1a.html,test_bug467672-2g.html,test_bug467672-3g.html,test_bug467672-4f | Test timed out.
928585 Empty favicon after adding a search engine
932055 Overlay buttons flicker or disappear when panning while zoomed
932208 BrowserToolbar and HomeFragment context menu 'Share' option should be disabled for these protocols: about:// chrome:// file://
933161 Balrog shouldn't serve updates to older builds
933168 Try on doesn't work for Lightweight Themes
933374 HUGE Performance regression, Deleting from history takes 14times as long since 20130612
933856 Wunderlist consumes > 100% cpu
934431 No option is pre checked in Clear private data
934902 TEST-UNEXPECTED-FAIL | test_feed_discovery.html,test_bug338583.html | application terminated with exit code 256 [@ memcmp | SECITEM_CompareItem_Util | ... | pkix_SignatureChecker_Check | ... | CERT_PKIXVerifyCert]
936377 Test failure "Component returned failure code: 0x80630001 (NS_ERROR_STORAGE_BUSY)" in /testFormManager/testDisableFormManager.js
936928 crash on Scirra SpaceBlaster benchmark
937220 crash in mozalloc_abort(char const* const) | NS_DebugBreak (###!!! ABORT: cycle collector fault: file e:/builds/moz2_slave/m-cen-w64-ntly-000000000000000/build/xpcom/base/nsCycleCollector.cpp, line 1054)
938313 b2g crashes when closing multiple apps
938885 Fix plugincheck to not use plugin enumeration
941063 Add a property to get the size of the downloads data written to disk
941606 Crash in xul!GCGraphBuilder::GCGraphBuilder
942151 Multiple failures in functional and endurance tests on Australis when window witdth is smaller
942543 Mochitest failures claiming that a test which has finished timed out four times, followed by "4 test timeouts, giving up"
942823 Test failure "The tab with index '1' has been selected" in /testTabbedBrowsing/testOpenInForeground.js
943206 Images and Videos scroll when they shouldn't when in frames with overflow-y: hidden
943843 The download size reported by Firefox is much smaller than the actual size on the disk when download size is not known initially.
944710 Test failure "can't convert undefined to object" in /testAddons_OpenAndCloseGetAddonsPane/test1.js
945703 Pasting a download link into the download manager sometimes fails.
946719 [xh, an] Add Xhosa and Aragonese locales to shipped-locales
946935 Awesome bar have scrollbar for small offset
947240 crash in mozilla::layers::CompositorD3D11::DrawQuad(mozilla::gfx::RectTyped<mozilla::gfx::UnknownUnits> const&, mozilla::gfx::RectTyped<mozilla::gfx::UnknownUnits> const&, mozilla::layers::EffectChain const&, float, mozilla::gfx::Matrix4x4 const&)
947284 End text-selection handle is not visible when opting to select all text
947581 WindowsPrefSync.jsm errors on startup
947981 broken --with-system-icu build
948115 [Notification Center] display generic icon when content icon is invalid or does not load in time
948199 [B2G][Browser][YouTube] YouTube.com webpage resolution width is reduced after changing orientation from landscape to portrait
948346 [Messages] When a message has multiple lines, the text is cut off.
948355 Unable to go to mozRequestFullScreen() in <body contextmenu=...>
948488 Hunt down all the places where DOM APIs return array COWs
948565 Page loads barely work on Galaxy Q
948567 Hover/mouseover for SVG circles of small radius may fail
948714 [B2G][First Time Experience][Date & Time] Continent and city selections do not update text or imagery until user changes date or time
948849 Thumbnail on home page missing for local html file
949016 [B2G][Bluetooth File Transfer][Music] Playback slider unmovable and causes audio issues while playing MP3 recieved by bluetooth transfer,
949198 ASan use-after-free [@ JSContext::runtime()] with TypedObject
949480 There is no progress bar present for gingerbread devices in android notification when downloading
949518 Incorrect caret offset if queried while accessible tree is mutating (affects changing value with arrow keys in input type="number")
950069 spotlight-module on youtube is handled as hidden
950085 Don't toggle text-selection action-bar visibility changes on repositioning of cursor in inputs
950373 Up and Down Keyboard Arrows no longer work in the Restore Session frame / box
950448 Web Developer splitmenu popup sizing is wrong in App Button on Aurora28.0a2 and Holly29.0a1 on Windows7 Classic Style
950453 Tab Groups button displays the wrong icon in the tab bar
950549 SVG path getTotalLength reports 0 for some cubic bezier segments
950711 No top-site screenshot for thumbnail position shown on particular URL
950766 [B2G][Window Management] wrapper UI incorrectly shows background when keyboard is shown
950827 [B2G][SMS] The Compose Message screen is displayed too low when launching the Message app from Contacts
950843 [B2G][Dialer] The footer navigation UI for the app is not present when adding another call
950928 [Samsung Galaxy S4] tiny favicons in Search settings
950989 [B2G][Gallery] Pressing thumbnail in Camera app while tapping screen to dismiss thumbnail overlay results in area of transparency
951013 After 10.9.1 upgrade, Firefox sometimes hangs when trying to use plugins and gfxCardStatus
951054 PageEntry strings should be recomputed when locale changes
951108 The Clock.app Timer suspends on app change
951172 Image opened in google images are incorrectly resized after changing orientation of the device
951238 Android builders and Android l10n repack machines have different aapt versions
951288 Intermittent test_bug495300.html | Assertion count 1 is greater than expected range (Start time must be before end time: 'startTime < endTime')
951356 Crash [@ memset] through js::SizedTypeRepresentation::initInstance
951529 Overlapping of words in moziilians.org edit page in firefox nightly
951575 CAPS does not work in Nightly(Holly)29.0a1
951715 Mozmill fails to properly initialize metro mode
951943 SelectionHandler._updateCacheForSelection() Error: "TypeError: rects[0] is undefined" at line: 726
951970 Sencha Ext JS components unresponsive when IonMonkey enabled
952048 SIGBUS on OpenBSD since libvpx 1.3.0 update
952372 Video cut off ijreview.com
952401 Scroll position isn't restored after reloading a scrolled page
952914 RFE: plugins.enumerable_whitelist_URLs to allow enumeration on a few trusted sites
953012 Double Tab III: Son of Double Tab (Opening a new tab using the overlay while a website is loading creates two about:start tabs)
953017 icon not shown at first in page info -> media
953037 100% CPU Load, no JS, CSS only. Bootstrap 3.0.3. Probably faulty page rendering engine
953085 SVG mask content is positioned incorrectly
953211 startup cache precompilation broken on sparc64 again
953239 Embedded YouTube videos cut off and pannable
955815 ecma_6/TypedObject/simd/float32x4abs.js will be permaorange on the February 3rd merge to mozilla-aurora
955825 Web Console prints escaped characters like '\n' as literal "\n" string instead of interpreting as a newline
955851 pdf.js, font rendering is jaggy when HWA off
955958 Fixed background images cause graphic artifacts
956125 [B2G][Keyboard] Input lag occurs when typing within the edit contact page
956149 [B2G][Cost Control] Data usage graph does not properly update when the device's date is manually adjusted
956166 Crash [@ searchLinear] or [@ js::jit::IonBuilder::traverseBytecode] or Assertion failure: isNewObject(), at jit/MIR.h
956183 [Download Manager] Edit icon in 'Downloads' list is not easily visible
956188 [B2G][Facebook][Homescreen] Able to create up to 3 Facebook apps on the homescreen
956346 [B2G][Download Manager] Download list not populating while downloading if the settings app is closed
956395 Unable to pan when visiting notebookreview in landscape
956418 [B2G][Browser] Browser app does not launch correctly when launching from another app
956460 100% load / freeze / crash in a very specific scenario introduced with FF 26 (doesn't happen on FF 24.2 ESR!)
956571 Select-All button in text-selection action-bar dismisses action bar and does not select any text
956614 Missing (transparent) frames with video tag
956665 mozmm doesn't reflects proper size in real screens
956716 Browser becomes unresponsive on attempt to invoke a context-menu on a base64 encoded PNG
956720 Some websites are loaded zoomed in
956789 Crash in attempt to share - android.content.ActivityNotFoundException (on uninstalled applications)
956797 crash in java.lang.NullPointerException: at org.mozilla.gecko.db.BrowserDB.getTopSites$5514332a(BrowserDB.java)
956900 Text-selection action-bar persists after a paste and adding a search engine operation; operation not treated as final
956955 crash in libGAL.so@0x5870e - Huawei devices
956963 crash in libstagefright.so@0xdaa35 - Kindle Fire 7" 2013
956966 crash in linker@0x4bd9 - Amazon Kindle Fire
956980 crash in js::jit::EnterBaselineMethod(JSContext*, js::RunState&) mostly with cached documents
957006 Crash in mozilla::Maybe<nsAutoString>::~Maybe() (or sometimes [@ EnterBaseline ], or something else) a minute or so after loading a Wired article in Fennec
957050 Web apps can not be uninstalled or added to home screen
957069 Web app install page loads scrolled down
957449 crash in mozilla::layers::TextureHost::Create(mozilla::layers::SurfaceDescriptor const&, mozilla::layers::ISurfaceAllocator*, unsigned int)
957521 Test failure "controller(): Window has been initialized." in ide@seleniumhq.org/tests/
957565 Delay in performing the actions - WebGL Games
957591 Quick share button is not populated when sharing from context menu
957603 Geolocation can not be shared
957693 Investigate the mid-December spike in mochitest shutdown timeouts across all platforms
958095 Array.prototype.keys() breaks web apps, e.g. dagre-d3
958249 Border on :first-letter not work correctly from version 25
958361 crash in SECITEM_CompareItem_Util
958491 WebGL bug in WebGLContext::GetFramebufferAttachmentParameter
958553 Couldn't correct locale. - java.lang.IllegalStateException: No ContextGetter; cannot fetch prefs.
958723 Crash in WebGLContext::GetFramebufferAttachmentParameter when WEBGL_draw_buffers is enabled
958904 OpenH264: global-buffer-overflow crash [@WelsDec::WelsResidualBlockCavlc]
959010 Throbber spins and clips outside of its boundary when forward button is revealed in primary tablet toolbar navigation UI
959080 crash in mozalloc_abort(char const*) | Abort | NS_DebugBreak | mozilla::ipc::MessageChannel::DebugAbort(char const*, int, char const*, char const*, bool) const
959108 Helper app opens different video on m.youtube.com
959189 SessionHistory check for private data has been removed
959210 keydown keyup keypress not triggering for firefox (26.0.1) and firefox beta(27.0)
959336 GIF image distorted on resize if firefox scaled
959544 Updating Firefox leaves zombie process behind
959644 focus is not reliable in certain contexts.
959662 NetdReceiver::DispatchNetdEvent::RunTask needs to root
959723 [B2G][Camera] Tapping take picture icon before Camera app fully loads causes icons to become unusable
959804 Intermittent tcheck2,tp4m | application crashed [@ libc.so + 0x11e78]
960202 crash in java.lang.IllegalStateException: Fragment already added: PinSiteDialog{$HEX_ADDRESS #$ pin_site} at android.support.v4.app.FragmentManagerImpl.addFragment(FragmentManager.java)
960389 Intermittent WinXP PGO TEST-UNEXPECTED-FAIL | browser_901207_searchbar_in_panel.js | Search container should be overflowing | followed by more customizableui bustage, some timeouts, and finally a crash
960644 Crash with glibc abort when decompiling function
960746 Back/forward button state can get out of sync on tablets
960758 [B2G][PDF Viewer] PDF screen reappears on its own after pressing Home button while viewing it in the Browser
960761 Intermittent browser_profiler_console_api.js | application crashed [@ mozilla::FrameLayerBuilder::BuildContainerLayerFor(nsDisplayListBuilder*, mozilla::layers::LayerManager*, nsIFrame*, nsDisplayItem*, nsDisplayList const&, mozilla::ContainerLayerParamet
960832 crash in property_get
961180 Firefox Accounts (Sign In) - 'Firefox is Syncing' notice; nothing is actually syncing
961184 Firefox Accounts (Sign In) - Missing an end step instruction
961187 Firefox Accounts (Sign In) - Change password non functional
961343 [e10s] [@ mozalloc_abort(char const*) | Abort | NS_DebugBreak | mozilla::dom::ContentChild::ProcessingError(mozilla::ipc::HasResultCodes::Result) ]
961360 [e10s] "Tab crashed" page's "Try again" button does not reload multiple tabs
961361 [e10s] Flash video problems with sounds but no video output
961362 [e10s] HTML5 video's fullscreen feature zooms video to fill tab, not screen
961431 Autocomplete suggestions in split console are sliding down
961466 crash in js::GCMarker::processMarkStackTop(js::SliceBudget&) on outlook.com
961475 High CPU usage on mynoise.net/NoiseMachines/whiteNoiseGenerator.php
961501 Home banner covers about:home data if list is too short to be scrolled
961538 Regression: Exception decoding bitmap from data URI: data:image/png;base64 -- java.lang.IllegalArgumentException: bytes.length 0 must be a positive number
961587 new profile has "Windows 8 Touch" bookmark folder
961717 Installed themes are present in about:add-ons only after refreshing the page
961722 Request Desktop site does not work on Wikipedia
961726 Table layout is not displayed correctly on Wikipedia
961730 cnn.com is always displayed as desktop site
961756 Firefox Accounts (Sign In) - Account created on desktop (and vice versa) not accepted on sign-in
961779 Firefox Accounts (Android ↔ Android) - sync is not working between devices
961791 Firefox Accounts (Sign-In) - Unable to sign-in successfully on my Galaxy SII (java.net.UnknownHostException: Unable to resolve host "api-accounts-onepw.dev.lcip.org" - No address associated with hostname
961796 AWFY FxOS regressions: Octane (~13.5% Mandreel) on Jan 16
961806 Firefox Accounts (Sync) - Synced Remote Tabs not syncing, or not showing up in our tab listing
961928 [e10s] EFF Panopticlick thinks cookies are disabled when "Accept third-party cookies" is "Never" when e10s is enabled
961929 [e10s] SessionHistoryInternal.collect@resource://app/modules/sessionstore/SessionHistory.jsm: TypeError: docShell is null
961939 [e10s] Salesforce widget fails with “Content Encoding Error”. Cc[name] is undefined RemoteAddonsParent.jsm:99
961997 Test failure 'plugin is undefined' in /restartTests/testAddons_pluginDisabledAfterRestart/test2.js
962070 Tooltips for sources contain the group URL instead of the file URL
962106 Progress bar animation refinements
962116 Text changes appearance when scrolling
962192 [B2G][Clock] Alarm in Clock app plays no sound alert
962195 [B2G][Settings][Sound] Unable to select ringer and alerts sound, the picker is empty
962492 Geolocation prompt/doorhanger not shown: "SettingsService failed to open DB!" and 0x80520015 (NS_ERROR_FILE_ACCESS_DENIED) [nsIFile.create]
962637 Firefox Accounts (Confirmation Mail) - Report it link not implemented
962702 Top sites mostly unresponsive for several seconds after load
962703 Firefox Accounts (Sync) - org.mozilla.gecko.sync.crypto.HMACVerificationException at org.mozilla.gecko.sync.crypto.CryptoInfo.decryp / java.lang.NullPointerException at org.mozilla.gecko.sync.CollectionKeys.differences
962713 Firefox Accounts - crash in java.lang.NullPointerException: at android.content.ComponentName.<init>(ComponentName.java)
962859 Intermittent ABORT: CRT ERROR HEAP CORRUPTION DETECTED | TEST-UNEXPECTED-FAIL | /tests/dom/indexedDB/test/test_webapp_clearBrowserData_inproc_inproc.html | application terminated with exit code 2147483651
962942 Possibly delayed event processing of minimize/maximize/resize
962971 Mousewheel isn't calibrated correctly on gist.github.com
963051 "Home page lists" settings page causes Nightly to stop
963062 Firefox accounts (Android) - Can't confirm emails using Firefox mobile - the confirmation links are broken
963106 Firefox Accounts (Sign-Up/Sign-In) - Age year not remembered if switching from Sign-Up/Sign-In
963118 Firefox Accounts (Android Settings) - Configure your Fx Account will open Firefox for android
963153 Firefox Accounts (Sync) - Sync failed: java.lang.IllegalArgumentException sync.prefs.org!mozilla!fennec!fxa.$.https://api-accounts-onepw.dev.lcip.org.1.xml contains a path separator
963168 Transition animation is black when click pending tab in Panorama view
963174 Reading list button will redirect you to history tab
963249 Regression: Menu difference on tablets between about:home and content
963269 Regression: Tabs opened in the background never fetch their site favicon
963460 Firefox crashes with invalid pointer during shutdown when run under xvfb [@ vp9_half_horiz_variance8x_h_sse2]
963464 [10.9] lcamtuf's canvas fuzzer: "Error: this application has passed an invalid numeric value (NaN, or not-a-number) to CoreGraphics API. It will become a fatal error in an upcoming update."
963540 Media files continues to play after the application is moved in background
963755 crash in java.lang.NullPointerException: at org.mozilla.gecko.home.HomeConfig$PanelConfig.<init>(HomeConfig.java)
963757 crash in java.lang.NullPointerException: Attempt to invoke virtual method ''java.lang.String java.lang.Object.toString()'' on a null object reference at android.widget.ArrayAdapter.createViewFromResource(ArrayAdapter.java)
963969 Unable to scroll through Motorola Motomaker website
964076 History dropdown of location bar steals mouse event from the Confirm Close Dialog.
964098 Page title is mangled in Reader Mode
964376 AudioBufferSourceNode.playbackRate does not sound great anymore
964379 OSX 10.6 xpcshell perma-fail due to "TypeError: active_tests() keywords must be strings"
964573 Firefox Accounts (Post Account Creation) - View indicates syncing; nothing checkmarked
964691 Tapping on URL bar in landscape mode does not display the on screen keyboard
964694 [Tablet] - Bing.com background is not properly resized for tablets
964701 Bing.com search field is not active on whole length
964762 Stack buffer overflow in content/media/webm/EbmlComposer.cpp
964796 Some of the rows have different outline than the others in the about: page
964807 (Synth APK) - Launching a privileged packaged app does not work
964813 crash in mozilla::AndroidBridge::GetJNIEnv()
964815 Firefox hangs for long time when opening box.com document (thousands of <use> elements)
964843 (Synth APK) - mozApps.install failed: org.json.JSONException: End of input at character 0 of
964859 crash in sqliteInternalCall
964877 (Synth APK) - Launching SoundCloud fails
964900 <li> element cut off on left side if text zoomed in
964952 (Synth APK) - APK Factory fails on Cut the Rope/Slice Fruits manifest
964994 No indication that installing an untrusted extension could be harmful
965053 [B2G][Everything.me] Many apps do not show that they have already been added to the Homescreen
965314 Intermittent ASAN use-after-poison in CERT_DestroyCertificate during test_bug514732.html
965321 Search suggestions are not available for private browsing
965332 Reader Mode reading list button is dysfunctional when Reading List is disabled
965335 Manually added Reader Mode items do not enter Reader Mode when Reading List is disabled
965485 (Synth APK) - APK Factory fails on Importer/Shanghai Majong/Bottle Shooter/Sound Trip
965496 (Synth APK) - APK Factory fails on Candle/Penguin Jump/Toolbox/Drawl
965513 (Synth APK) - APK Factory fails on Poker Master
965690 Caret disappears in Rich text editor after modal dialog closing
965701 (Synth APK) Uninstalling a webapp from android settings, does not remove it from about:apps page
965780 Video thumbnails bar is flickering on trailers.apple.com after toggling a mouseover/mouseout action
965808 about:home urls are case sensitive
965817 Empty space at the Tools menu display - HTC Sensation 4G
966001 heap-use-after-free in mozilla::dom::HTMLMediaElement::LookupMediaElementURITable()
966173 "too much recursion" on Linux trying to file U.S. income tax in Firefox 28
966214 No Favicon sites acts like a phantom when pinned
966235 Test failure "persisted.addon is undefined" in testAddons_installUninstallHardBlocklistedExtension/test2.js
966298 Firefox Accounts (Get started UI) - Links don't preserve style after being opened
966303 Firefox Accounts (Account Manag. Screen) - ToS and PN don't respect the styling
966363 "News" page at bbc.co.uk never finishes loading in Metro Firefox
966369 heap-use-after-free in libxul.so!nsTArray_base<nsTArrayInfallibleAllocator, nsTArray_CopyWithMemutils>::EnsureCapacity()
966453 with HW accel disabled, dark border-top of chrome window
966490 Crashes in js::ObjectImpl::getClass() under WeakMap::keyNeedsMark with poisoned GC pointer
966580 [regression] Eideticker fresh and dirty startup time regression on Jan 28
966612 Escape key should exit Print Preview
966701 No fullscreen toolbar appears by mouse after doing "Restore Previous Session"
966714 Stylish addon triggers ASSERTION: Category manager doesn't support persistence.: 'Error', file xpcom/components/nsCategoryManager.cpp, line 613
966715 Forecastfox addon triggers ASSERTION: Load failed!!!: 'NS_SUCCEEDED(rv)', file dom/xbl/nsXBLResourceLoader.cpp, line 140
966716 "Similar Sites" addon prevents Firefox 27+ from opening ANY new windows
966717 Shift-Insert not working in editor (composer) window
966790 html5 youtube player embedded in iframe is scrollable
966791 Home Banner appears outside of about:home
966844 Consider hiding the spin buttons for <input type=number> when its width is too narrow, e.g. at skyscanner.com
966919 event.preventDefault() does not cancel default action of "touchend" event (resulting in click events firing on unintended elements on vimeo.com)
967087 crash in js::jit::IonContext::~IonContext()
967126 Ensure we send unique telemetry probes from Metro vs. Desktop
967259 Intermittent Jetpack addon-page/main.test that add-on page has no chrome | chrome is not visible for addon page - false == true
967580 Firefox Accounts (Sync) - 401 Unauthorized; credentials work fine on other device
967712 Firefox Accounts (Sync) - Invalid timestamp immediately after signing in
967763 crash in mozilla::gfx::Matrix::HasNonIntegerTranslation() const
967892 "f=regular" in netError pages
967924 correct resampler input buffer sample count estimate math
968181 Google sees cookies disabled after clearing private datas
968213 An extra doorhanger is displayed when tapping the Mixed Content Blocking shield icon
968219 flash does not work on Nexus 7
968428 Janky experience when verifying
968738 Bookmarks opened from home screen are not marked as bookmarked
968827 The synced tab menu occupy approx 3/4 of the page after changing the orientation to portrait
968847 Race condition in error case in DefineConstructorAndPrototype
969222 [OMT Animations] Popups of HTML selects don't grab the mouse
969253 "Save files to" is ignored if set it to Drive root such as "D:"
969297 Error: this._walker is null when click items, All mouse interaction fails.
969354 Black rect to left of the about:start watermark displays when scrolling
969391 Firefox slower than Chrome on BitcoinBench
969477 Purchase of paid apps is broken due to JS error - aRequests[0].wrappedJSObject is undefined
969765 Regression with javascript performance
969824 neterror page for invalid address shows garbage
969831 Switching from desktop to metro fails if the device doesn't support directx feature level 9.3 or higher
969923 clearInterval inside setTimeout causes crash in Greasemonkey and Firefox 27/28
970052 Intermittent browser_URLBarSetURI.js | This test exceeded the timeout threshold. It should be rewritten or split up.
970061 Tapping update notification does nothing when browser not running
970100 crash in mozalloc_abort(char const*) | NS_DebugBreak | mozilla::ipc::MessageChannel::DebugAbort ... | mozilla::layers::PImageBridgeParent::~PImageBridgeParent()
970117 crash in libstagefright.so@0xfa41d PowerVR SGX 540 - Android 4.2.x
970131 Takes about a minute of inactivity before Android requests installation on old device
970290 Intermittent | test_browserElement_NoPref.html | Should not send mozbrowserloadstart event.
970365 [tablet] - Missing dividers in custom menu Sony Xperia Tablet Z in about:home
970368 crash in JSScript::code()
970375 crash in igd10umd32.dll@0xadb2
970478 Certificate error pages are not completely translated in localized builds (missing pipnss.properties in build)
970876 Broken display of chart.apis.google.com with Firefox Aurora (29)
970941 Flash content flickers on devices running android 4.4 kitkat
970965 [Session Restore] Twitter tab are restored to the one state before the actual state
971059 Signed in on Android and Desktop, and nothing is syncing.
971095 Content shrinks and does not take entire screen width after browser reset
971152 IPv6 detection on linux depends on availability of /proc/net/if_inet6
971194 Signed out of Sync against my will
971221 Dialogs created by add-ons bug the Awesome Bar (location bar)
971226 Crash - java.lang.NullPointerException at org.mozilla.gecko.home.TabMenuStrip.onPageSelected(TabMenuStrip.java:78)
971355 HTC T-mobile G2 - Compositor hangs when user interacts with the URL bar
971429 Grooveshark.com crashes when playing in background after 30 seconds - libmozalloc.so@0x91e
971660 [tablet] - Settings menu options are not staying highlighted
971724 Firefox is not recovered after crash on some devices
971786 Firefox Accounts (Activities) - Set android:excludeFromRecents on the status activity?
971869 taping inside empty URL bar places a monocle at the top left corner
971909 Firefox Accounts - Carry-over credentials from existing account when attempting to create new account when user is attempting to sign-in instead
971920 Firefox Accounts (Sync) - Error ending transaction org.mozilla.gecko.sqlite.SQLiteBridgeException: Can't step statement: (1) cannot commit - no transaction is active
971959 DevTools Themes: Resizing Inspector's right panel to fill all available horizontal space results in breadcrumb z-index issue.
972052 Hidden Garmin Communication Plugin is no longer detected (even with always active)
972200 New addon entries appear at the top of the about:addons list, not alphabetically, when new addons installed by Sync
972247 crash in libstagefright.so@0x16f2cf - Lenovo B8000
972312 Event dispatched to the global for script errors is not an ErrorEvent
972734 java.lang.NullPointerException: at android.os.Parcel.readException(Parcel.java) at org.mozilla.gecko.GeckoAppShell.getHandlersForIntent(GeckoAppShell.java:970)
972827 Add hosted App - hide placeholder when user click on the URL field
972858 Australis corrupted places.sqlite - BookmarksToolbar appears empty
973348 Element highlighted on a tap should always receive the click event
973537 testrun_update never ran testDirectUpdate
973592 Compatibility problems due to removing 1024-bit GTE Cybertrust roots (e.g. *.bpost.be)
973626 Firefox Accounts (Sign-Up) - 'Email' field is not visible when the device is in landscape mode
973639 Graphic in PDF is completely ommited
973913 ExtendedValidation.cpp fails to compile with older gcc 4.4 compiler (nullptr problem)
973942 Crash on application launch when installed via Guest Browsing
974150 top visited site reloads in tile but doesn't open
974232 Playing <audio> that is attached to a MediaElementSourceNode causes popping noise initially
974262 Compatibility problems due to removing 1024-bit Entrust roots
974380 crash in java.lang.UnsupportedOperationException: Unknown query URI content://org.mozilla.firefox_beta.db.browser/bookmarks?profile=webapp1&limit=1 at android.database.DatabaseUtils.readExceptionFromParcel(DatabaseUtils.java)
974500 Firefox 29 and 30 aren't matching c.eu2.content.force.com with a wildcard subjectAlternativeName entry in eu2.force.com's certificate
974656 Linux crash in gfxContext::PushClipsToDT(mozilla::gfx::DrawTarget*)
974837 Strange behaviour when clicking on a link in multi-column layout (column-* CSS)
974846 (Nexus 7) - Tapping the android back button will not dismiss Firefox on some devices
974930 Test failure "Add-on has been specified. - got 'undefined'" in restartTests
974971 Firefox does not always restart if requested but closes
975014 Assertion during shutdown: Extra shutdown CC: 'i < NORMAL_SHUTDOWN_COLLECTIONS' in nsCycleCollector.cpp, line 3151
975397 border-image on element with :visited-dependent styles gives ###!!! ABORT: Should be tracking any image we're going to use!: 'mImageTracked', layout\style \nsStyleStruct.h, line 208
975533 Reader Mode toolbar jumps when opening from an about:home panel
975566 crash in java.lang.NullPointerException: at org.mozilla.gecko.gfx.GeckoLayerClient.syncViewportInfo(GeckoLayerClient.java)
975585 (Synth APK) - Bubble Meadow multiple manifests yield multiple APKs which yield MULTIPLE_APPS_PER_ORIGIN_FORBIDDEN
975840 SVG doesn't entirely respect its clip-path, on Android
975991 Extensions without icon get displayed with the icon of the previous extension viewed if extension does not come from AMO
976004 devtools.webconsole.fontSize doesn't have any effect anymore
976079 [Phone] Favicons in URL bar are not fetched after opening settings menu and "Don't keep activities" is enabled
976144 Don't show progress bar on load of about: pages
976149 [FxA] Firefox Sync intermittently disconnects with error.login.reason.no_recoverykey after "Authentication error in _fetchTokenForUser"
976525 [Gingerbread] Doorhanger for allow theme is misplaced
976673 While mouseup event is being dispatched, event handlers cannot steal focus from inaccessible element if preceding mousedown event's preventDefault() is called
976715 Scrollbar of dark theme breaks mouse interaction
976723 Selection handle scrolls outside boundary of <input> on page scroll
976724 With <input type="color"> on Mac OS X, when color picker is redirected away from an <input> (by clicking another one), you can't make it target the original <input> again
976726 Connect Text on first page is cut in google.hu
976730 Missing connect button in google.me
976732 Missing connect button in google.kz
976736 Missing connect button in google.mk
976740 Missing connect button in google.mn
976745 Missing connect button in google.tn
976747 Missing connect button in google.so
976862 contenteditable div is duplicated when MSWord content is copied/pasted when div is inside a dd tag
977173 Content interactions navigate user away from viewed page
977246 Facebook menu immediately closes and refreshes the page
977520 Rendering issue with 1/1 Direct3D 11 (OMTC) enabled
977608 Disconnecting the device while an app is installing will disable Update / Debug buttons
977674 Assertion failure: GetIonScript(script, executionMode)->isRecompiling(), at jit/CodeGenerator.cpp:6183
977704 Back button reloads page without images
977953 Epic Citadel crashes with dirty profile
978022 Margin doesn't work properly when hardware acceleration is on
978154 preventDefault on a touch event don't prevent the mouse event emulation
978291 about:downloads can't handle drag events if downloads list is empty
978377 crash in android.database.sqlite.SQLiteConstraintException: error code 0x13: constraint failed at android.database.sqlite.SQLiteStatement.native_executeInsert(Native Method) Kindle
978453 Themes are distorted in Firefox Android
978465 Character Encoding menu in View Source window shows checkmark for windows-1252 when another encoding declared by <meta>
978566 Australis: Check mark and highlight of "Bookmarks sidebar" in Bookmarks widget pull down is missing
978599 Australis: Titlebar and window controls flickers when toggle tabgroup(Ctrl+Shift+E)
978777 A file picker and an alert can be shown at the same time, making the window unresponsive
978955 Open New Window logs error: nsLivemarkService.js :: LS_getLivemark :: A promise chain failed to handle a rejection.
979221 Video playback is not displayed correctly (pink) on Motorola Atrix (Android 2.3)
979316 Toasts are almost transparent and it can't be read on Honeycomb devices
979430 Menu options triggered while in awesomescreen (URL tapped) on HW Menu button phones
979790 about:firefox page is loaded zoomed in
979899 Regression: Swiping away FxAccountStatusActivity will disable all widget UI in GeckoPreferences back in the browser
980061 Position of Image preview is wrong after using color picker once in dark theme
980276 Keyword added to a bookmark will also be added to other bookmarks if the bookmarks are the same
980328 Right click on history item in the history panel opens the item.
980360 Fade in tab titles and close buttons when opening a tab
980366 removing "windows touch" from the file menu if fxmetro not supported
980464 Certain pages freeze for several seconds when loading
980557 geolocation app bar notifications don't fit in portrait mode
980575 google maps content not redrawn properly when changing screen orientation
980781 Error executing regex
980800 Firefox startup crashes when trying to create a local socket via ctypes [@ pt_SetSocketOption ]
980848 NSS 3.15.5 & 3.16 uses c++-styles comments in c files
980938 Crash of Adobe Flash with protected mode enabled and clearing cookies [@ F2102588022]
981306 CSS transition animation lags with document.body or document.body.parentNode
982017 First opened app is opened when tapping on the helper app, no matter what type of app should be used
982019 Going back to a page in reader mode, fails to load the article
982064 Show address-bar on new tab open after text-selection search (do not persist current page visibility)
982142 [Honeycomb] Corrupt display of text selection handles for URL on tablet - Android 3.2
982731 "Windows 8 Touch" folder not being removed from bookmarks
982776 Wrong text highlighting in .gov.ar domains
982814 MessageMe app uses default/generic Android icon
983627 Reader mode toolbar is not fixed to bottom of content window
983996 "Exit Tab Groups" Icon still indicate number of groups
984040 Html and Css problem with "marquee" and "OnMouseOver"
984234 Intermittent TalosError: Exception caught: junit.framework.AssertionFailedError: EditText is not found! [browser_output.txt]
984301 Google Chrome app is opened when tapping on the helper app in m.youtube.com
984310 Helper app icon in the URL bar, is not displayed after tapping back from external app
984359 [x86] Flash playback yields black display
984922 Videos are not rendered correctly on desktop version of youtube
985188 Flash video playback not fitting the designated video box
985211 Disabling hub panels in regular mode affects guest mode
985303 Horizontal scroll area does not include right margins
985351 Browser unresponsive when I perform "Clear Recent History" everything when there are many history entries
985422 Test failure "Modal dialog has been found and processed" in restartTests\testAddons_InstallAddonWithoutEULA\test1.js
985479 Planet.mozilla.org can be scrolled off the content
985489 UiTour[Linux]: Graphical glitch during the highlight animation.
985824 Search for link text context menu item should pay attention to selection
985882 SVG as a background-image is pixelated with transform rotate and scale applied
985935 Wikipedia - Unable to interact with the video media container
985936 Door-hanger position is misplaced when URL bar is hidden
985940 Tab list does not retract after swiping to close a tab
985974 [Gingerbread] Visual artifacts in the playback controls for <video>
986030 Unnecessary scroll to reveal full branding on the 'Welcome to Sync' screen
986528 Firefox Accounts (Get started UI) - un-necesary scroll in the page
986592 Australis: Deleting a separator removes the parent folder
986664 Make Android FxAccountClient* HAWK requests always include request payload hash
986764 [Stability][Performance] Cleanup of Threads after PeerConnection destroyed
986798 svg textpath with cubic bezier curve doesn't work anymore
986834 zoom gets reset when moving tabs between windows
986886 addEventListener in GM script would not work if javascript.enabled = false
987127 [Windows 8.1] Videos are not played by the youtube html5 player.
987150 PeekMessage() sometimes fails to remove found char message, then, we sometimes lose the message
987197 Opacity on element nested in scaled parent affects position
987223 No visible H.264 video playback on MPEG-4 AVC (part 10) (avc1) (Planar 4:2:0 YUV) on Android 4.0 devices
987340 crash in java.lang.NullPointerException: at org.mozilla.gecko.favicons.decoders.LoadFaviconResult.getBytesForDatabaseStorage(LoadFaviconResult.java)
987480 Show Australis whatsnew tour page upon update for all locales on Firefox 29 release builds
987531 crash in xtls.dll@0x1d1f5
987687 crash in java.lang.NullPointerException: at org.mozilla.gecko.webapp.ApkResources.getManifestUrl(ApkResources.java)
987795 [Honeycomb] launcher crash in Android's createIconBitmap on application install (com.android.launcher)
987939 Upgraded builds on beta, aurora, and m-c channel have blank Firefox tile on the start screen
988524 crash in java.lang.NullPointerException: at org.mozilla.gecko.sync.Utils.hex2Byte(Utils.java)
988626 crash in JS_BeginRequest(JSContext*)
988642 crash in CDevice::ID3D10Device1_CopySubresourceRegion_(ID3D10Device1*, ID3D10Resource*, unsigned int, unsigned int, unsigned int, unsigned int, ID3D10Resource*, unsigned int, D3D10_BOX const*)
988714 Can't remove memchaser from customization panel in customize mode after moving it there
988919 Artifacts while playing flash videos
988991 Able to pan an iframe that shouldn't be pannable
989062 Regression: TLS 1.2 connection failure / Cisco WebEx
989282 Add debug mode for detailed inspection of Sync
989592 Rendering failure with Chrome and IE providing acceptable result
989769 [OSX] Vertical scrolling is blocked
989885 text-shadow don't work when printing
990042 Sync Promo banner shown after account addition
990083 crash in libc.so@0xd5a8 - Samsung Android 4.2.x
990196 icu tries to use INSTALL_SCRIPT during build
990314 Galaxy S4 keyboard appends to current url instead of replacing it
990473 missing next button in <input type='number' >
990631 web console popup is misaligned on Windows after bug 961431
990709 Australis: Menu Bar of the background window always shows active states (Windows7 Classic)
990780 Crash in [@mozilla::MediaPluginReader::DecodeAudioData()] on "Seeking to unbuffered position with continuous playback" test
990812 Window-level frame scripts are loaded into add-on panels and cause errors
991148 Extra characters deleted in URL bar when backspacing
991705 Missing default add-on icon in about:addons for no bundled icons
991926 [e10s] crash in mozalloc_abort(char const* const) | NS_DebugBreak | mozilla::dom::ContentChild::ProcessingError(mozilla::ipc::HasResultCodes::Result)
992264 Assertion failure: (ss->adjustDataSize(compressedLength)), at jsscript.cpp
992521 ShadowRoot is marked to be in document, although it isn't
992927 The widget panel displayed on mark button press shows cutoff bullet points
993325 radial-gradient backgrounds not always aligned correctly to right edge of background area
993344 The "Show tab previews in the Windows taskbar" option doesn't appear in Tabs section for in-content preferences
993383 A dialog window without title bar appears after pressing on some buttons for in-content preferences
993432 Visual artifacts when playing an embedded mp4 video
993705 Number-only search queries don't work
994056 Name of the "about:preferences" tab is displayed differently across platforms
994232 crash in @0x0 | SweepZones
994252 crash in nsTArray_Impl<nsLineBreaker::TextItem, nsTArrayInfallibleAllocator>::Clear()
994328 Australis tabs leave some UI behind when closing tabs on Linux with Intel GPU
994623 Australis: Invert icons in the tabstrip and menubar on Ubuntu
994931 Graphic glitch when zoom-in, ("scroll" event does not fire when Zoom-In after landing Bug 681192)
995063 After finished in textbox with TouchPal Keyboard, page flickers
995138 Switching between normal and guest browsing doesn't keep the correct number of tabs open
995182 [adbe 3744253] crash in npswf32_13_0_0_182.dll@0x23b1bd
995339 Gap between favicon and title when switching from secure page
995347 Entering "h" in URL bar shows "http:/" or "https:/" as autocompletion
995826 Differential Testing: Different output message involving Math.round and Math.tan
995896 Deep Links with Flash do not work in Firefox on Linux
996027 Ensure that TPS always fakes login into Weave
996185 No transition animation of customize at the first time
996303 crash in NS_ABORT_OOM(unsigned int) | AppendUTF8toUTF16(nsACString_internal const&, nsAString_internal&)
996590 Tabs are not restored if Firefox is closed with QuitNow addon
997049 "Switch to tab" does not work for Reading List entries
997109 Some SVG animatemotion paths are wrongly followed, depending on their points
997134 Google search results displayed as JSON blobs in reader mode
997189 Absolutely positioned inline-block (or inline) element with floating nextSibling and auto "left" is positioned to the right of the float
997634 Visual artifacts on the cookie notification banner from fancourier.ro
997755 MessageMe new updates are found each time a "Check for updates" is performed
997783 MessageMe application uses a default/generic Android icon: failure retrieving icon -- java.lang.NullPointerException android.app.ApplicationPackageManager.putCachedIcon(ApplicationPackageManager.java:865)
997873 Mixed content icon is displayed instead of Green EV identifier
997921 Regression - Cursor doesn't change to RTL shape
998603 Firefox on Asus Memopad HD7 with Android 4.2.2 plays video frames out of order
998773 Find bar: "Match Case" should prevent curly quotes from matching straight quotes
998781 Remove sw during beta-release migration for Firefox 29
998929 Title bar obscures top of page after returning from fullscreen with title bar auto-hide disabled
998970 Screen tear flicker between return animation out of Edit Mode between org.mozilla.fennec:id/menu_icon and org.mozilla.fennec:id/tabs
999061 MOZ_ASSERT(!mRawPtr) assert at storage/src/mozStorageService.cpp:940 during shutdown when HTTPS Everywhere addon is installed
999100 Findbar Highlight mode is continued even if [Highlight All] button indicates off
999198 Android Firefox Account client handling of remotely deleted accounts
999284 Firefox 29.0 printing blank page instead of PDF
999936 Some animateMotion cases are broken
1000151 EV indicator stops appearing after restart (even without session restore)
1000169 [TABLET] User agent issue on http://www.bing.com/maps
1000400 skyscanner.com layout broken because site doesn't leave enough room for arrow buttons on <input type="number">
1000704 The border between the toolbox and customize palette has a border which leaks into the padding
1000864 [Android] Sync options dialog can be accessed from Firefox menu only after the initial sync ends
1000887 PlayCanvas JavaScript displays incorrect behaviour unless debugger is open
1001236 crash in mozalloc_abort(char const*) | mozalloc_handle_oom(unsigned int) | moz_xmalloc | mozilla::FileBlockCache::BlockChange::BlockChange(unsigned char const*)
1001240 crash in SECITEM_CompareItem_Util
1001242 crash in libhwui.so@0x17d36 - Samsung Android 4.1.x crash
1001512 crash in java.lang.IllegalStateException: attempt to re-open an already-closed object: SQLiteDatabase: /data/data/org.mozilla.firefox/files/mozilla/$PROFILE.default/browser.db at android.database.sqlite.SQLiteClosable.acquireReference(SQLiteClosable.java)
1001607 crash in js::ExecuteRegExp(JSContext*, JS::Handle<JSObject*>, JS::Handle<JSString*>, js::MatchConduit&, js::RegExpStaticsUpdate)
1001624 crash in libflashplayer.so@0x75be5e
1001904 crash in mozalloc_abort(char const* const) | mozalloc_handle_oom(unsigned int) | moz_xmalloc | nsMultiplexInputStreamConstructor(nsISupports*, nsID const&, void**)
1002486 Clicking the toolbar download button drops browser window focus
1002537 incrementAndGet concurrency risk in FaviconCache
1002910 Firefox renders U+FFFC OBJECT REPLACEMENT CHARACTER as  [obj] but Chrome discards it
1003123 [Gingerbread] Context menu hidden under graphic overlay in about:home after opening Firefox from background
1003127 [Gingerbread] Toolbar is not hidden when watching a video in Full Screen, and dynamictoolbar is set to "false"
1003717 "Arabic" Character encoding menu is not translated
1003761 Cannot edit a cookie or remove breakpoints via devtoolbar (TypeError: arg.text.toLowerCase is not a function)
1004007 Outlook Web Access text wrapping regression
1005078 Sync Configuration - Configuration options are not honoured after selection on existing account
1005647 URL bar is misplaced when opening a new private window with tree-style tabs addon installed
1005663 Restoring tabs from last session causes reopening of closed popups
1005784 media/webrtc/trunk/webrtc/modules/audio_device/linux/audio_device_pulse_linux.cc:3132:52: warning: 'szKey' is used uninitialized in this function
1005859 console.log(...) in Firebug will log the string into bulit-in Browser Console of Firefox 29 (PageMod API's bug??)
1006639 Show the /firstrun & /whatsnew tour to users updating to 29.0.1
1007680 Home, End, Up and Down keys no longer work when editing a table cell
1008190 Scroll position is lost on Twitter when clicking a tweet and then back
1008271 JNI.jsm leaks references
1008459 Tablet: section heading not selected when launching a specific Settings section
1008895 InternalError: an error occurred while executing regular expression
1008946 HTC One (m8) - crash in libomxpluginkk.so (deleted)@0x2234
1009150 Broken page layout on m.clippercard.com
1009662 Inconsistency at adding YouTube Search Engine
1010124 Accelerometer API not working on Nexus 10
1010311 Storage services run by United Internet AG (GMX File Storage, 1&1 SmartDrive) don't work on Firefox 29
1010725 Menu Items remain highlighted while hovered in High Contrast mode
1010946 Buttons are completely black and their text is not visible on dark High Contrast themes
1010960 Prefs are unreadeable in dark High Contrast themes
1011059 crash in java.lang.IllegalArgumentException: invalid selection notification range: 0 to #, length: # at org.mozilla.gecko.GeckoEditable.onSelectionChange(GeckoEditable.java)
1011273 crash in libxul.so@0xe1b9a8 | jsimd_ycc_rgb_convert
1012526 UITour.jsm only registers with UITelemetry when it's lazily imported on-demand
1013574 Repainted curved tab when toggle nglayout.debug.paint_flashing
1014034 Duck Duck Go content gets shifted down on every resize (keyboard dismissal)
1014615 After switching (or restoring) tab, StarUI becomes colored light blue though locationbar is invalid state
1015166 Content in transparent window on Linux doesn't render correctly when shown/hidden
1015611 --enable-debug crashes around nsIFrame::AssociateImage on opening www.newegg.com
1015649 [@ JS_CallHeapScriptTracer(JSTracer*, JS::Heap<JSScript*>*, char const*) ]
1016127 Error: this.menuBoxObject is undefined When I click "Subscribe to this feed using" select box
1017095 Mozilla Firefox Javascript JIT Use-After-Free Remote Code Execution Vulnerability
1017316 crash in java.lang.IllegalStateException: Fragment HistoryPanel{41b35288} is not currently in the FragmentManager at android.support.v4.app.FragmentManagerImpl.saveFragmentInstanceState(FragmentManager.java)
1017899 Browser Console's HTTP request popup window is only partially rendered from external display to HiDPI display
1020738 Normal selected tab stays selected after opening a private tab
1020995 Text selection action bar is invoked on long tapping a images in Google Images
1021617 Some webapps are using generic android icon
1021700 Visual artifacts in the flash content on Gingerbread devices
1021916 Page panning gestures are consumed by page video container divs, unable to pan page if gesture initiated from within

614 Total; 614 Open (100%); 0 Resolved (0%); 0 Verified (0%);